{"text_format":"1","workbook":"xlsx","n_sheets":16,"sheets":["Instructions","Nutrient Management","Corn K Calculations","Soybean K Calculations","Wheat K Calculations","Fertilizer Products & Pricing","Manure and Nutrient Credits","Fertilizer Plan (Alfalfa)","Fertilizer Plan (Alfalfa-Grass)","Fertilizer Plan (Grass)","Product Purchase List (Alfalfa)","Product Purchase List (A&G Mix)","Product Purchase List (Grass)","Simple Fertilizer Calculator","Tri-State Recommendations","Charts"],"not_rendered":{"charts":0,"images":48,"macros":1,"external_links":0,"defined_names":26,"comments":0,"pivot_tables":0},"unopened":[],"bounds":{"document_bytes":16777216,"sheet_cells":100000,"rows_first":2000,"rows_last":500,"rows_between":2000,"halvings":0,"cell_chars":16384,"cell_head_chars":4096},"cells_cut":0,"cells_raw":0,"read":"whole","date_system":"1900"}

{"sheet":"Instructions","index":0,"n_rows":42,"n_cols":16,"rows_kept":42,"cut":false,"hidden":false,"merged":[[25,4,25,14],[41,1,42,17],[20,4,20,17],[19,4,19,17],[18,4,18,17],[21,4,21,17],[30,4,31,17],[33,4,33,17],[34,4,35,17],[36,4,36,17],[37,4,38,17],[33,2,38,2],[26,4,27,17],[28,4,29,17],[17,4,17,17],[22,4,23,17],[24,4,24,17],[0,0,2,17],[6,0,6,17],[5,0,5,17],[3,0,3,17],[12,2,12,17],[4,0,4,17],[13,4,14,17],[15,4,16,17],[8,5,8,12]]}
["Fertilizer Cost Comparison Tool (Forages)"]
[]
[]
["Template by: Jon LaPorte, Farm Management Educator"]
["Michigan State University Extension"]
["120 N. Broadway, Suite 116, Cassopolis, MI 49031"]
["Phone: (269) 445-4356          Email: laportej@msu.edu"]
[]
[null,null,null,null,null,"Version 7.0"]
[]
["1)","Each TAB represents an important aspect of fertilizer planning (i.e., nutrient management, sources of fertilizer, and overall fertilizer plan for each commodity).  Click on a TAB to enter specific  information."]
[null,"These include:"]
[]
[null,null,"Nutrient Management","-","Input yield goals, soil test based nutrient recommendations, manure nutrient analysis, and nutrient credits.  This section will determine the total amount of nutrients that will need to be supplied through commercial fertilizer products.  "]
[]
[null,null,"Cover Crops in Step 6: Nutrient Credit",null,"For \"Nitrogen Credit\" of Step 6, cover crops must be manually typed into \"Select Previous Crop\" field.  Under the Nitrogen Value, enter amount of credit based on provided chart."]
[]
[null,null,null,null,"This section provides detailed information for use with the Fertilizer Plan sections to determine how much commercial fertilizer will need to be applied."]
[null,null,"Fertilizer Products & Pricing","-","Input the products and prices for fertilizer, lime, and nitrogen stabilizers to use in the Fertilizer Plan.  Common fertilizer products are already provided."]
[null,null,null,null,"Each crop has its own tab (i.e. Fertilizer - Corn)"]
[null,null,"Fertilizer Plan Tabs","-","Choose the fertilizer from the drop-down menu and enter product/acre to be used.  (i.e. 100lbs/acre of 9-23-30 = 50lbs 18-46-0 & 50lbs 0-0-62lbs)"]
[null,null,"(Alfalfa, Alfalfa-Grass, Grass)",null,"Note: Includes an in-depth assessment of nutrients provided at each application of the farm's fertilizer program."]
[null,null,"Tri-State Recommendations","-","This section allows for calculating of P and K values needed to meet yield goals based on Tri-State Recommendations.  The information can be transferred to the Nutrient Management page for use in commercial fertilizer cost comparison.  "]
[]
[null,null,null,null,"Note: This section is not a replacement for recommendations from a soil test analysis obtained from soil test laboratories.  "]
[null,null,null,null,"For soil test based recommendations, visit the MSU Soil and Plant Nutrient Laboratory:",null,null,null,null,null,null,null,null,null,null,"https://www.canr.msu.edu/spnl/"]
[null,null,"Product Purchase List (per crop)","-","These are a series of tabs that will total the amount of product you will need to complete your Fertilizer Plans. The intent is that these tabs can be printed and taken to your local farm retailer to help in securing your farm's fertilizer needs. "]
[null,null,"New In This Version"]
[null,null,null,null,"Note: Includes an option to choose between the three comparison plans within each crop, so products listed reflect the comparison plan the farm selects as the best choice to pursue for the growing season. Must supply number of acres to populate accurate product totals. "]
[]
[null,null,"Simple Fertilizer Calculator","-","This section contains a calculation for finding cost per acre on select fertilizer products.  There are also calculators to extract nitrogen and sulfur costs from combination fertilizer products."]
[]
[]
[null,null,"Manure Applications ---START HERE",null,"Do you plan to include manure cost in your fertilizer plan?  Go to the Fertilizer Products & Pricing worksheet"]
[null,null,null,null,"Note: There is a Manure Calculator to input nutrient analysis values.  The calculator will adjust values based on selected number of days before manure is expected to be incorporated.  Retention factors used to adjust values are based on 2022 proposed MI GAAMPS charts."]
[]
[null,null,null,null,"Do you plan to include only commercial fertilizer products in your fertilizer plan?  Go to the Nutrient Management worksheet"]
[null,null,null,null,"Note: Step 4 provides an area to include values of manure, preferably based on a nutrient analysis.  Values can also be adjusted based on selected number of days before manure is expected to be incorporated.  Retention factors used to adjust values are based on 2022 proposed MI GAAMPS charts."]
[]
["2)","Only items that are colored in BLUE should be altered in each TAB.  Changing the value of an item not marked BLUE can cause the formulas in the spreadsheet to stop working."]
[]
["3)","The Nutrient Management and Fertilizer Plan Tabs can be printed for your farm records.  The Fertilizer Plan Tab also allows for printing of three different plans for your chosen commodity.  This allows for comparison of different fertilizer sources to identify the best way to meet nutrient needs at the lowest possible cost."]

{"sheet":"Nutrient Management","index":1,"n_rows":92,"n_cols":23,"rows_kept":92,"cut":false,"hidden":false,"merged":[[0,0,2,0],[0,1,0,11],[1,1,1,3],[1,5,1,7],[1,9,1,11],[7,1,7,11],[3,1,3,11],[8,1,8,11],[20,15,20,17],[4,0,6,0],[8,0,19,0],[14,13,15,13],[18,13,19,13],[12,17,12,18],[10,15,10,18],[13,17,13,18],[2,15,2,25],[21,15,21,17],[79,1,79,11],[51,1,51,11],[30,1,30,11],[21,1,21,11],[46,1,46,11],[50,1,50,11],[45,1,45,11],[29,1,29,11],[39,1,39,11],[77,9,77,11],[40,1,40,11],[48,1,48,2],[48,5,48,6],[48,9,48,10],[47,22,52,25],[46,0,49,0],[40,0,44,0],[30,0,38,0],[21,0,28,0],[43,13,44,13],[28,15,31,19],[33,15,34,19],[41,15,42,19],[47,1,47,2],[47,5,47,6],[51,0,52,0],[47,9,47,10],[37,1,37,3],[37,5,37,7],[37,9,37,11],[64,0,65,0],[20,1,20,11],[53,5,53,7],[53,9,53,11],[65,1,65,3],[65,5,65,7],[65,9,65,11],[53,1,53,3]]}
[null,"Nutrient Management",null,null,null,null,null,null,null,null,null,null,null,null,null,"Additional Resources:"]
[null,"Alfalfa",null,null,null,"Alfalfa-Grass Mix",null,null,null,"Grass",null,null,null,null,null,"For more information on Fertilizer Recommendations, see: "]
[null,null,null,null,null,null,null,null,null,null,null,null,null,null,null,"MSU Bulletin E-2904, Nutrient Recommendations for Field Crops in Michigan - In process of updating (8/20/24)"]
["Step 1:","Yield Goal:",null,null,null,null,null,null,null,null,null,null,null,null,null,"Tri-State Fertilizer Recommendations"]
[null,null,"(Enter Below)",null,null,null,"(Enter Below)",null,null,null,"(Enter Below)"]
[null,null,0,null,null,null,0,null,null,null,0,null,null,null,null,"MSU Fertilizer Recommendation Program"]
[null,null,null,null,null,null,null,null,null,null,null,null,null,null,null,"https://www.canr.msu.edu/fertrec/"]
["Step 2: ","Soil Test Based Recommendations:"]
[null,"Obtain from MSU Fertilizer Recommendation Program, Tri-State Recommendations or your local soil lab."]
[null,"(Enter Below)","(Enter Below)","(Enter Below)",null,"(Enter Below)","(Enter Below)","(Enter Below)",null,"(Enter Below)","(Enter Below)","(Enter Below)"]
[null,"N","P","K",null,"N","P","K",null,"N","P","K",null,null,null,"PPM to Pounds (Lbs) Conversion Calculator"]
[null,0,0,0,null,0,0,0,null,0,0,0,null,null,null,"(Enter Below)"]
[null,"S","Ca","Mag",null,"S","Ca","Mag",null,"S","Ca","Mag",null,"More",null,"PPM",null,"Pounds (Lbs)"]
[null,0,0,0,null,0,0,0,null,0,0,0,null,"Below",null,0,"x 2",{"$f":"P14*2","v":0}]
[null,"Z","B","Mn",null,"Z","B","Mn",null,"Z","B","Mn",null,"¯"]
[null,0,0,0,null,0,0,0,null,0,0,0]
[null,"Cu","Mo","Fe",null,"Cu","Mo","Fe",null,"Cu","Mo","Fe"]
[null,0,0,0,null,0,0,0,null,0,0,0]
[null,"Lbs/Acre","Lbs/Acre","Lbs/Acre",null,"Lbs/Acre","Lbs/Acre","Lbs/Acre",null,"Lbs/Acre","Lbs/Acre","Lbs/Acre",null,"¯"]
[]
["Step 3: ","Nutrient Removal",null,null,null,null,null,null,null,null,null,null,null,null,null,"Alfalfa/Grass Mix Adjustment "]
[null,"Amount of nutrients being removed based on yield goal.",null,null,null,null,null,null,null,null,null,null,null,null,null,"for Nutrient Removal Rate"]
[null,null,null,null,null,"*based on mix of Alfalfa and Grass in field -->",null,null,null,"*based on Timothy Grass (MSU Bulletin E-2904)",null,null,null,null,null,null,"(Enter Below)"]
[null,"N","P","K",null,"N","P","K",null,"N","P","K",null,null,null,"Alfalfa",0.65]
[null,null,{"$f":"C6*13","v":0},{"$f":"C6*50","v":0},null,{"$f":"G6*((45*Q24)+(45*Q25))","v":0},{"$f":"((G6*13)*Q24)+((G6*17)*Q25)","v":0},{"$f":"((G6*50)*Q24)+((G6*62)*Q25)","v":0},null,{"$f":"K6*45","v":0},{"$f":"K6*17","v":0},{"$f":"K6*62","v":0},null,null,null,"Grass",0.35]
[null,"S","Ca","Mag",null,"S","Ca","Mag",null,"S","Ca","Mag"]
[null,{"$f":"5.4*C6","v":0},0,0,null,{"$f":"((G6*5.4)*Q24)+((G6*0)*Q25)","v":0},0,0,null,{"$f":"0.07*K6","v":0},0,0]
[null,"Lbs/Acre","Lbs/Acre","Lbs/Acre",null,"Lbs/Acre","Lbs/Acre","Lbs/Acre",null,"Lbs/Acre","Lbs/Acre","Lbs/Acre",null,null,null,"Nutrient Recommendation"]
[null,null,null,null,null,null,null,null,null,null,null,null,null,null,null,"Nutrient removal rates are based on soil nutrients at \"maintenance levels.\"  Soil testing is recommended to confirm maintenance levels exist prior to consideration of removal rates.  "]
["Step 4: ","Manure  Application - This Year"]
[null,"Input nutrients being provided in manure applications \"this year\" (based on nutrient analysis results)."]
[null,"(Enter Below)","(Enter Below)","(Enter Below)",null,"(Enter Below)","(Enter Below)","(Enter Below)",null,"(Enter Below)","(Enter Below)","(Enter Below)"]
[null,"N","P","K",null,"N","P","K",null,"N","P","K"]
[null,0,0,0,null,0,0,0,null,0,0,0,null,null,null,"MSU recommends using soil test-based information to address nutrient needs of your intended yield goals."]
[null,"S",null,null,null,"S",null,null,null,"S"]
[null,0,null,"(Select Below)",null,0,null,"(Select Below)",null,0,null,"(Select Below)"]
[null,"Days Before Incorporation",null,"----",null,"Days Before Incorporation",null,"----",null,"Days Before Incorporation",null,"----",null,null,null,"Manure Resources"]
[null,"*for all liquid and solid manure types",null,null,null,"*for all liquid and solid manure types",null,null,null,"*for all liquid and solid manure types",null,null,null,null,null,"Manure application methods and nitrogen losses (University of Minnesota)"]
[null,null,null,null,null,null,null,null,null,null,null,null,null,null,null,"Michigan GAAMPS",null,"←  See table A4 in Manure Mgmt & Utilization section for approximate manure values in place of nutrient analysis"]
["Step 5: ","Nutrient Credit: Manure - Previous Year(s)"]
[null,"Input nutrients being provided in manure applications from previous year(s).",null,null,null,null,null,null,null,null,null,null,null,null,null,"Note:"]
[null,"(Enter Below)","(Enter Below)","(Enter Below)",null,"(Enter Below)","(Enter Below)","(Enter Below)",null,"(Enter Below)","(Enter Below)","(Enter Below)",null,"More",null,"If you are using manure or compost, for best results a nutrient analysis is highly recommended."]
[null,"N","P","K",null,"N","P","K",null,"N","P","K",null,"Below"]
[null,0,0,0,null,0,0,0,null,0,0,0,null,"¯"]
[]
["Step 6: ","Nutrient Credit: Previous Crop",null,null,null,null,null,null,null,null,null,null,null,null,null,"For use with Step 6 (per MSU Bulletin: E-2904)",null,null,null,"For use with Step 6 (per Managing Cover Crops Profitability from SARE)"]
[null,"Input nutrients being credited from legume crops planted in previous year.",null,null,null,null,null,null,null,null,null,null,null,null,null,null,null,null,null,"Cover Crop","Lb./Acre"]
[null,"(Select Below)",null,"N",null,"(Select Below)",null,"N",null,"(Select Below)",null,"N",null,null,null,null,null,null,null,"Mustard","30-120",null,"Type in \"Cover Crop\" in \"Select Previous Crop\" field and enter Nitrogen value from chart range"]
[null,"Select Previous Crop",null,{"$f":"VLOOKUP(B49,'Manure and Nutrient Credits'!$A$3:$B$16,2,FALSE)","v":0},null,"Select Previous Crop",null,{"$f":"VLOOKUP(F49,'Manure and Nutrient Credits'!$A$3:$B$16,2,FALSE)","v":0},null,"Select Previous Crop",null,{"$f":"VLOOKUP(J49,'Manure and Nutrient Credits'!$A$3:$B$16,2,FALSE)","v":0},null,null,null,null,null,null,null,"Radish","50-200"]
[null,null,null,null,null,null,null,null,null,null,null,null,null,null,null,null,null,null,null,"Rapeseed","40-160"]
["Step 7: ","Total Nutrients Needed From Commercial Fertilizer",null,null,null,null,null,null,null,null,null,null,null,null,null,null,null,null,null,"Berseem Clover","75-220"]
[null,"Nutrients still needed based on starting point of soil test recommendations or nutrient removal rates, minus any manure or nutrient credits. ",null,null,null,null,null,null,null,null,null,null,null,null,null,null,null,null,null,"Cowpea","100-150"]
[null,null,null,null,null,null,null,null,null,null,null,null,null,null,null,null,null,null,null,"Crimson Clover","70-130"]
[null,"Soil Test Based Recs",null,null,null,"Soil Test Based Recs",null,null,null,"Soil Test Based Recs",null,null,null,null,null,null,null,null,null,"Field Pea","90-150"]
[null,"N","P","K",null,"N","P","K",null,"N","P","K",null,null,null,null,null,null,null,"Hairy Vetch","90-200"]
[null,{"$f":"B12-(B34*'Manure and Nutrient Credits'!$D$27)-B44-D49","v":0},{"$f":"C12-(C34*'Manure and Nutrient Credits'!$D$27)-C44","v":0},{"$f":"D12-(D34*'Manure and Nutrient Credits'!$D$27)-D44","v":0},null,{"$f":"F12-(F34*'Manure and Nutrient Credits'!$D$30)-F44-H49","v":0},{"$f":"G12-(G34*'Manure and Nutrient Credits'!$D$30)-G44","v":0},{"$f":"H12-(H34*'Manure and Nutrient Credits'!$D$30)-H44","v":0},null,{"$f":"J12-(J34*'Manure and Nutrient Credits'!$D$33)-J44-L49","v":0},{"$f":"K12-(K34*'Manure and Nutrient Credits'!$D$33)-K44","v":0},{"$f":"L12-(L34*'Manure and Nutrient Credits'!$D$33)-L44","v":0},null,null,null,null,null,null,null,"Red Clover","70-150"]
[null,{"$f":"MAX(0,B56)","v":0},{"$f":"MAX(0,C56)","v":0},0,null,{"$f":"MAX(0,F56)","v":0},{"$f":"MAX(0,G56)","v":0},{"$f":"MAX(0,H56)","v":0},null,{"$f":"MAX(0,J56)","v":0},{"$f":"MAX(0,K56)","v":0},{"$f":"MAX(0,L56)","v":0},null,null,null,null,null,null,null,"Sweetclover","90-170"]
[null,"S","Ca","Mag",null,"S","Ca","Mag",null,"S","Ca","Mag",null,null,null,null,null,null,null,"White Clover","80-200"]
[null,{"$f":"B14-(B36*'Manure and Nutrient Credits'!$D$27)","v":0},{"$f":"C14","v":0},{"$f":"D14","v":0},null,{"$f":"F14-(F36*'Manure and Nutrient Credits'!$D$30)","v":0},{"$f":"G14","v":0},{"$f":"H14","v":0},null,{"$f":"J14-(J36*'Manure and Nutrient Credits'!$D$33)","v":0},{"$f":"K14","v":0},{"$f":"L14","v":0},null,null,null,null,null,null,null,"White Clover","80-200"]
[null,{"$f":"MAX(0,B59)","v":0},{"$f":"MAX(0,C59)","v":0},0,null,{"$f":"MAX(0,F59)","v":0},{"$f":"MAX(0,G59)","v":0},{"$f":"MAX(0,H59)","v":0},null,{"$f":"MAX(0,J59)","v":0},{"$f":"MAX(0,K59)","v":0},{"$f":"MAX(0,L59)","v":0},null,null,null,null,null,null,null,"Chart 2: Performance and Roles"]
[null,"Z","B","Mn",null,"Z","B","Mn",null,"Z","B","Mn",null,null,null,null,null,null,null,"https://www.sare.org/wp-content/uploads/Managing-Cover-Crops-Profitably.pdf"]
[null,0,0,0,null,0,0,0,null,0,0,0]
[null,"Cu","Mo","Fe",null,"Cu","Mo","Fe",null,"Cu","Mo","Fe"]
[null,{"$f":"B18","v":0},{"$f":"C18","v":0},0,null,0,0,0,null,0,0,0]
[]
[null,"Nutrient Removal Recs",null,null,null,"Nutrient Removal Recs",null,null,null,"Nutrient Removal Recs"]
[null,"N","P","K",null,"N","P","K",null,"N","P","K"]
[null,{"$f":"B25-(B34*'Manure and Nutrient Credits'!$D$27)-B44-D49","v":0},{"$f":"C25-(C34*'Manure and Nutrient Credits'!$D$27)-C44","v":0},{"$f":"D25-(D34*'Manure and Nutrient Credits'!$D$27)-D44","v":0},null,{"$f":"F25-(F34*'Manure and Nutrient Credits'!$D$30)-F44-H49","v":0},{"$f":"G25-(G34*'Manure and Nutrient Credits'!$D$30)-G44","v":0},{"$f":"H25-(H34*'Manure and Nutrient Credits'!$D$30)-H44","v":0},null,{"$f":"J25-(J34*'Manure and Nutrient Credits'!$D$33)-J44-L49","v":0},{"$f":"K25-(K34*'Manure and Nutrient Credits'!$D$33)-K44","v":0},{"$f":"L25-(L34*'Manure and Nutrient Credits'!$D$33)-L44","v":0}]
[null,{"$f":"MAX(0,B89)","v":0},{"$f":"MAX(0,C89)","v":0},{"$f":"MAX(0,D89)","v":0},null,{"$f":"MAX(0,F89)","v":0},{"$f":"MAX(0,G89)","v":0},{"$f":"MAX(0,H89)","v":0},null,{"$f":"MAX(0,J89)","v":0},{"$f":"MAX(0,K89)","v":0},{"$f":"MAX(0,L89)","v":0}]
[null,"S","Ca","Mag",null,"S","Ca","Mag",null,"S","Ca","Mag"]
[null,{"$f":"B27-(B36*'Manure and Nutrient Credits'!$D$27)","v":0},{"$f":"C27","v":0},{"$f":"D27","v":0},null,{"$f":"F27-(F36*'Manure and Nutrient Credits'!$D$30)","v":0},{"$f":"G27","v":0},{"$f":"H27","v":0},null,{"$f":"J27-(J36*'Manure and Nutrient Credits'!$D$33)","v":0},{"$f":"K27","v":0},{"$f":"L27","v":0}]
[null,{"$f":"MAX(0,B71)","v":0},{"$f":"MAX(0,C71)","v":0},0,null,{"$f":"MAX(0,F71)","v":0},{"$f":"MAX(0,G71)","v":0},0,null,{"$f":"MAX(0,J71)","v":0},{"$f":"MAX(0,K71)","v":0},0]
[null,"Z","B","Mn",null,"Z","B","Mn",null,"Z","B","Mn"]
[null,0,0,0,null,0,0,0,null,0,0,0]
[null,"Cu","Mo","Fe",null,"Cu","Mo","Fe",null,"Cu","Mo","Fe"]
[null,0,0,0,null,0,0,0,null,0,0,0]
[]
[null,null,null,null,null,null,null,null,null,"Enter Farm Name"]
[]
[null,"Use this information to help determine the amount of commercial fertilizer needed in the Fertilizer Plan tab."]
[]
[null,"Soil Test Based Recommendations",null,null,null,"Soil Test Based Recommendations",null,null,null,"Soil Test Based Recommendations"]
[null,{"$f":"B12-(B34*'Manure and Nutrient Credits'!$D$27)-B44-D49","v":0},{"$f":"C12-(C34*'Manure and Nutrient Credits'!$D$27)-C44","v":0},{"$f":"D12-(D34*'Manure and Nutrient Credits'!$D$27)-D44","v":0},null,{"$f":"F12-(F34*'Manure and Nutrient Credits'!$D$30)-F44-H49","v":0},{"$f":"G12-(G34*'Manure and Nutrient Credits'!$D$30)-G44","v":0},{"$f":"H12-(H34*'Manure and Nutrient Credits'!$D$30)-H44","v":0},null,{"$f":"J12-(J34*'Manure and Nutrient Credits'!$D$33)-J44-L49","v":0},{"$f":"K12-(K34*'Manure and Nutrient Credits'!$D$33)-K44","v":0},{"$f":"L12-(L34*'Manure and Nutrient Credits'!$D$33)-L44","v":0}]
[null,{"$f":"MAX(0,B83)","v":0},{"$f":"MAX(0,C83)","v":0},0,null,{"$f":"MAX(0,F83)","v":0},{"$f":"MAX(0,G83)","v":0},{"$f":"MAX(0,H83)","v":0},null,{"$f":"MAX(0,J83)","v":0},{"$f":"MAX(0,K83)","v":0},{"$f":"MAX(0,L83)","v":0}]
[null,{"$f":"B14-(B36*'Manure and Nutrient Credits'!$D$27)","v":0},null,null,null,{"$f":"F14-(F36*'Manure and Nutrient Credits'!$D$30)","v":0},null,null,null,{"$f":"J14-(J36*'Manure and Nutrient Credits'!$D$33)","v":0}]
[null,{"$f":"MAX(0,B85)","v":0},null,null,null,{"$f":"MAX(0,F85)","v":0},null,null,null,{"$f":"MAX(0,J85)","v":0}]
[]
[null,"Nutrient Removal",null,null,null,"Nutrient Removal",null,null,null,"Nutrient Removal"]
[null,{"$f":"B25-(B34*'Manure and Nutrient Credits'!$D$27)-B44-D49","v":0},{"$f":"C25-(C34*'Manure and Nutrient Credits'!$D$27)-C44","v":0},{"$f":"D25-(D34*'Manure and Nutrient Credits'!$D$27)-D44","v":0},null,{"$f":"F25-(F34*'Manure and Nutrient Credits'!$D$30)-F44-H49","v":0},{"$f":"G25-(G34*'Manure and Nutrient Credits'!$D$30)-G44","v":0},{"$f":"H25-(H34*'Manure and Nutrient Credits'!$D$30)-H44","v":0},null,{"$f":"J25-(J34*'Manure and Nutrient Credits'!$D$33)-J44-L49","v":0},{"$f":"K25-(K34*'Manure and Nutrient Credits'!$D$33)-K44","v":0},{"$f":"L25-(L34*'Manure and Nutrient Credits'!$D$33)-L44","v":0}]
[null,{"$f":"MAX(0,B89)","v":0},{"$f":"MAX(0,C89)","v":0},{"$f":"MAX(0,D89)","v":0},null,{"$f":"MAX(0,F89)","v":0},{"$f":"MAX(0,G89)","v":0},{"$f":"MAX(0,H89)","v":0},null,{"$f":"MAX(0,J89)","v":0},{"$f":"MAX(0,K89)","v":0},{"$f":"MAX(0,L89)","v":0}]
[null,{"$f":"B27-(B36*'Manure and Nutrient Credits'!$D$27)","v":0},null,null,null,{"$f":"F27-(F36*'Manure and Nutrient Credits'!$D$30)","v":0},null,null,null,{"$f":"J27-(J36*'Manure and Nutrient Credits'!$D$33)","v":0}]
[null,{"$f":"MAX(0,B91)","v":0},null,null,null,{"$f":"MAX(0,F91)","v":0},null,null,null,{"$f":"MAX(0,J91)","v":0}]

{"sheet":"Corn K Calculations","index":2,"n_rows":24,"n_cols":4,"rows_kept":24,"cut":false,"hidden":true,"merged":[]}
[9,50,"IF(AND(E8<=50,'Crop Budget (Main)'!C14<=100,D14<=9),125,IF(AND(E8<=50,'Crop Budget (Main)'!C14<=120,D14<=9),130,IF(AND(E8<=50,'Crop Budget (Main)'!C14<=140,D14<=9),135,IF(AND(E8<=50,'Crop Budget (Main)'!C14<=160,D14<=9),140,IF(AND(E8<=50,'Crop Budget (Main)'!C14<=180,D14<=9),145,IF(AND(E8<=50,'Crop Budget (Main)'!C14>180,D14<=9),145"]
[9,100,"IF(AND(E8<=100,'Crop Budget (Main)'!C14<=100,D14<=9),95,IF(AND(E8<=100,'Crop Budget (Main)'!C14<=120,D14<=9),100,IF(AND(E8<=100,'Crop Budget (Main)'!C14<=140,D14<=9),105,IF(AND(E8<=100,'Crop Budget (Main)'!C14<=160,D14<=9),110,IF(AND(E8<=100,'Crop Budget (Main)'!C14<=180,D14<=9),115,IF(AND(E8<=100,'Crop Budget (Main)'!C14>180,D14<=9),115"]
[9,150,"IF(AND(E8<=150,'Crop Budget (Main)'!C14<=100,D14<=9),65,IF(AND(E8<=150,'Crop Budget (Main)'!C14<=120,D14<=9),70,IF(AND(E8<=150,'Crop Budget (Main)'!C14<=140,D14<=9),75,IF(AND(E8<=150,'Crop Budget (Main)'!C14<=160,D14<=9),80,IF(AND(E8<=150,'Crop Budget (Main)'!C14<=180,D14<=9),85,IF(AND(E8<=150,'Crop Budget (Main)'!C14>180,D14<=9),80"]
[9,235]
[9,260]
[9,280]
[19,50,"IF(AND(E8<=50,'Crop Budget (Main)'!C14<=100,D14<=19),160,IF(AND(E8<=50,'Crop Budget (Main)'!C14<=120,D14<=19),165,IF(AND(E8<=50,'Crop Budget (Main)'!C14<=140,D14<=19),170,IF(AND(E8<=50,'Crop Budget (Main)'!C14<=160,D14<=19),175,IF(AND(E8<=50,'Crop Budget (Main)'!C14<=180,D14<=19),180,IF(AND(E8<=50,'Crop Budget (Main)'!C14>180,D14<=19),180"]
[19,100,"IF(AND(E8<=100,'Crop Budget (Main)'!C14<=100,D14<=19),120,IF(AND(E8<=100,'Crop Budget (Main)'!C14<=120,D14<=19),125,IF(AND(E8<=100,'Crop Budget (Main)'!C14<=140,D14<=19),135,IF(AND(E8<=100,'Crop Budget (Main)'!C14<=160,D14<=19),140,IF(AND(E8<=100,'Crop Budget (Main)'!C14<=180,D14<=19),145,IF(AND(E8<=100,'Crop Budget (Main)'!C14>180,D14<=19),145"]
[19,150,"IF(AND(E8<=150,'Crop Budget (Main)'!C14<=100,D14<=19),85,IF(AND(E8<=150,'Crop Budget (Main)'!C14<=120,D14<=19),90,IF(AND(E8<=150,'Crop Budget (Main)'!C14<=140,D14<=19),95,IF(AND(E8<=150,'Crop Budget (Main)'!C14<=160,D14<=19),100,IF(AND(E8<=150,'Crop Budget (Main)'!C14<=180,D14<=19),105,IF(AND(E8<=150,'Crop Budget (Main)'!C14>180,D14<=19),100"]
[19,250,"IF(AND(E8<=250,'Crop Budget (Main)'!C14<=100,D14<=19),45,IF(AND(E8<=250,'Crop Budget (Main)'!C14<=120,D14<=19),50,IF(AND(E8<=250,'Crop Budget (Main)'!C14<=140,D14<=19),60,IF(AND(E8<=250,'Crop Budget (Main)'!C14<=160,D14<=19),65,IF(AND(E8<=250,'Crop Budget (Main)'!C14<=180,D14<=19),70,IF(AND(E8<=250,'Crop Budget (Main)'!C14>180,D14<=19),70"]
[19,280]
[19,300]
[29,100,"IF(AND(E8<=100,'Crop Budget (Main)'!C14<=100,D14<=29),195,IF(AND(E8<=100,'Crop Budget (Main)'!C14<=120,D14<=29),200,IF(AND(E8<=100,'Crop Budget (Main)'!C14<=140,D14<=29),210,IF(AND(E8<=100,'Crop Budget (Main)'!C14<=160,D14<=29),215,IF(AND(E8<=100,'Crop Budget (Main)'!C14<=180,D14<=29),220,IF(AND(E8<=100,'Crop Budget (Main)'!C14>180,D14<=29),220"]
[29,150,"IF(AND(E8<=150,'Crop Budget (Main)'!C14<=100,D14<=29),145,IF(AND(E8<=150,'Crop Budget (Main)'!C14<=120,D14<=29),150,IF(AND(E8<=150,'Crop Budget (Main)'!C14<=140,D14<=29),160,IF(AND(E8<=150,'Crop Budget (Main)'!C14<=160,D14<=29),165,IF(AND(E8<=150,'Crop Budget (Main)'!C14<=180,D14<=29),170,IF(AND(E8<=150,'Crop Budget (Main)'!C14>180,D14<=29),170"]
[29,250,"IF(AND(E8<=250,'Crop Budget (Main)'!C14<=100,D14<=29),95,IF(AND(E8<=250,'Crop Budget (Main)'!C14<=120,D14<=29),100,IF(AND(E8<=250,'Crop Budget (Main)'!C14<=140,D14<=29),110,IF(AND(E8<=250,'Crop Budget (Main)'!C14<=160,D14<=29),115,IF(AND(E8<=250,'Crop Budget (Main)'!C14<=180,D14<=29),120,IF(AND(E8<=250,'Crop Budget (Main)'!C14>180,D14<=29),120"]
[29,310]
[29,330]
[29,350,null,"IF(AND(E8<=50,'Crop Budget (Main)'!C14<=100,D14<=9),125,IF(AND(E8<=50,'Crop Budget (Main)'!C14<=120,D14<=9),130,IF(AND(E8<=50,'Crop Budget (Main)'!C14<=140,D14<=9),135,IF(AND(E8<=50,'Crop Budget (Main)'!C14<=160,D14<=9),140,IF(AND(E8<=50,'Crop Budget (Main)'!C14<=180,D14<=9),145,IF(AND(E8<=50,'Crop Budget (Main)'!C14>180,D14<=9),145,IF(AND(E8<=100,'Crop Budget (Main)'!C14<=100,D14<=9),95,IF(AND(E8<=100,'Crop Budget (Main)'!C14<=120,D14<=9),100,IF(AND(E8<=100,'Crop Budget (Main)'!C14<=140,D14<=9),105,IF(AND(E8<=100,'Crop Budget (Main)'!C14<=160,D14<=9),110,IF(AND(E8<=100,'Crop Budget (Main)'!C14<=180,D14<=9),115,IF(AND(E8<=100,'Crop Budget (Main)'!C14>180,D14<=9),115,IF(AND(E8<=150,'Crop Budget (Main)'!C14<=100,D14<=9),65,IF(AND(E8<=150,'Crop Budget (Main)'!C14<=120,D14<=9),70,IF(AND(E8<=150,'Crop Budget (Main)'!C14<=140,D14<=9),75,IF(AND(E8<=150,'Crop Budget (Main)'!C14<=160,D14<=9),80,IF(AND(E8<=150,'Crop Budget (Main)'!C14<=180,D14<=9),85,IF(AND(E8<=150,'Crop Budget (Main)'!C14>180,D14<=9),80,IF(AND(E8<=50,'Crop Budget (Main)'!C14<=100,D14<=19),160,IF(AND(E8<=50,'Crop Budget (Main)'!C14<=120,D14<=19),165,IF(AND(E8<=50,'Crop Budget (Main)'!C14<=140,D14<=19),170,IF(AND(E8<=50,'Crop Budget (Main)'!C14<=160,D14<=19),175,IF(AND(E8<=50,'Crop Budget (Main)'!C14<=180,D14<=19),180,IF(AND(E8<=50,'Crop Budget (Main)'!C14>180,D14<=19),180,IF(AND(E8<=100,'Crop Budget (Main)'!C14<=100,D14<=19),120,IF(AND(E8<=100,'Crop Budget (Main)'!C14<=120,D14<=19),125,IF(AND(E8<=100,'Crop Budget (Main)'!C14<=140,D14<=19),135,IF(AND(E8<=100,'Crop Budget (Main)'!C14<=160,D14<=19),140,IF(AND(E8<=100,'Crop Budget (Main)'!C14<=180,D14<=19),145,IF(AND(E8<=100,'Crop Budget (Main)'!C14>180,D14<=19),145,IF(AND(E8<=150,'Crop Budget (Main)'!C14<=100,D14<=19),85,IF(AND(E8<=150,'Crop Budget (Main)'!C14<=120,D14<=19),90,IF(AND(E8<=150,'Crop Budget (Main)'!C14<=140,D14<=19),95,IF(AND(E8<=150,'Crop Budget (Main)'!C14<=160,D14<=19),100,IF(AND(E8<=150,'Crop Budget (Main)'!C14<=180,D14<=19),105,IF(AND(E8<=150,'Crop Budget (Main)'!C14>180,D14<=19),100,IF(AND(E8<=200,'Crop Budget (Main)'!C14<=100,D14<=19),45,IF(AND(E8<=200,'Crop Budget (Main)'!C14<=120,D14<=19),50,IF(AND(E8<=200,'Crop Budget (Main)'!C14<=140,D14<=19),60,IF(AND(E8<=200,'Crop Budget (Main)'!C14<=160,D14<=19),65,IF(AND(E8<=200,'Crop Budget (Main)'!C14<=180,D14<=19),70,IF(AND(E8<=200,'Crop Budget (Main)'!C14>180,D14<=19),70,IF(AND(E8<=100,'Crop Budget (Main)'!C14<=100,D14<=29),195,IF(AND(E8<=100,'Crop Budget (Main)'!C14<=120,D14<=29),200,IF(AND(E8<=100,'Crop Budget (Main)'!C14<=140,D14<=29),210,IF(AND(E8<=100,'Crop Budget (Main)'!C14<=160,D14<=29),215,IF(AND(E8<=100,'Crop Budget (Main)'!C14<=180,D14<=29),220,IF(AND(E8<=100,'Crop Budget (Main)'!C14>180,D14<=29),220,IF(AND(E8<=150,'Crop Budget (Main)'!C14<=100,D14<=29),145,IF(AND(E8<=150,'Crop Budget (Main)'!C14<=120,D14<=29),150,IF(AND(E8<=150,'Crop Budget (Main)'!C14<=140,D14<=29),160,IF(AND(E8<=150,'Crop Budget (Main)'!C14<=160,D14<=29),165,IF(AND(E8<=150,'Crop Budget (Main)'!C14<=180,D14<=29),170,IF(AND(E8<=150,'Crop Budget (Main)'!C14>180,D14<=29),170,IF(AND(E8<=200,'Crop Budget (Main)'!C14<=100,D14<=29),95,IF(AND(E8<=200,'Crop Budget (Main)'!C14<=120,D14<=29),100,IF(AND(E8<=200,'Crop Budget (Main)'!C14<=140,D14<=29),110,IF(AND(E8<=200,'Crop Budget (Main)'!C14<=160,D14<=29),115,IF(AND(E8<=200,'Crop Budget (Main)'!C14<=180,D14<=29),120,IF(AND(E8<=200,'Crop Budget (Main)'!C14>180,D14<=29),120"]
[30,150]
[30,200]
[30,250]
[30,360]
[30,380]
[30,400]

{"sheet":"Soybean K Calculations","index":3,"n_rows":24,"n_cols":4,"rows_kept":24,"cut":false,"hidden":true,"merged":[]}
[9,50,"IF(AND(I8<=50,'Crop Budget (Main)'!G14<=30,H14<=9),140,IF(AND(I8<=50,'Crop Budget (Main)'!G14<=40,H14<=9),155,IF(AND(I8<=50,'Crop Budget (Main)'!G14<=50,H14<=9),170,IF(AND(I8<=50,'Crop Budget (Main)'!G14<=60,H14<=9),180,IF(AND(I8<=50,'Crop Budget (Main)'!G14<=70,H14<=9),195,IF(AND(I8<=50,'Crop Budget (Main)'!G14>70,H14<=9),195"]
[9,100,"IF(AND(I8<=100,'Crop Budget (Main)'!G14<=30,H14<=9),110,IF(AND(I8<=100,'Crop Budget (Main)'!G14<=40,H14<=9),125,IF(AND(I8<=100,'Crop Budget (Main)'!G14<=50,H14<=9),135,IF(AND(I8<=100,'Crop Budget (Main)'!G14<=60,H14<=9),150,IF(AND(I8<=100,'Crop Budget (Main)'!G14<=70,H14<=9),165,IF(AND(I8<=100,'Crop Budget (Main)'!G14>70,H14<=9),165"]
[9,150,"IF(AND(I8<=150,'Crop Budget (Main)'!G14<=30,H14<=9),80,IF(AND(I8<=150,'Crop Budget (Main)'!G14<=40,H14<=9),90,IF(AND(I8<=150,'Crop Budget (Main)'!G14<=50,H14<=9),105,IF(AND(I8<=150,'Crop Budget (Main)'!G14<=60,H14<=9),105,IF(AND(I8<=150,'Crop Budget (Main)'!G14<=70,H14<=9),120,IF(AND(I8<=150,'Crop Budget (Main)'!G14>70,H14<=9),120"]
[9,235]
[9,260]
[9,280]
[19,50,"IF(AND(I8<=50,'Crop Budget (Main)'!G14<=30,H14<=19),175,IF(AND(I8<=50,'Crop Budget (Main)'!G14<=40,H14<=19),190,IF(AND(I8<=50,'Crop Budget (Main)'!G14<=50,H14<=19),205,IF(AND(I8<=50,'Crop Budget (Main)'!G14<=60,H14<=19),215,IF(AND(I8<=50,'Crop Budget (Main)'!G14<=70,H14<=19),230,IF(AND(I8<=50,'Crop Budget (Main)'!G14>70,H14<=19),230"]
[19,100,"IF(AND(I8<=100,'Crop Budget (Main)'!G14<=30,H14<=19),135,IF(AND(I8<=100,'Crop Budget (Main)'!G14<=40,H14<=19),150,IF(AND(I8<=100,'Crop Budget (Main)'!G14<=50,H14<=19),165,IF(AND(I8<=100,'Crop Budget (Main)'!G14<=60,H14<=19),180,IF(AND(I8<=100,'Crop Budget (Main)'!G14<=70,H14<=19),195,IF(AND(I8<=100,'Crop Budget (Main)'!G14>70,H14<=19),195"]
[19,150,"IF(AND(I8<=150,'Crop Budget (Main)'!G14<=30,H14<=19),100,IF(AND(I8<=150,'Crop Budget (Main)'!G14<=40,H14<=19),115,IF(AND(I8<=150,'Crop Budget (Main)'!G14<=50,H14<=19),130,IF(AND(I8<=150,'Crop Budget (Main)'!G14<=60,H14<=19),140,IF(AND(I8<=150,'Crop Budget (Main)'!G14<=70,H14<=19),155,IF(AND(I8<=150,'Crop Budget (Main)'!G14>70,H14<=19),155"]
[19,250,"IF(AND(I8<=250,'Crop Budget (Main)'!G14<=30,H14<=19),60,IF(AND(I8<=250,'Crop Budget (Main)'!G14<=40,H14<=19),75,IF(AND(I8<=250,'Crop Budget (Main)'!G14<=50,H14<=19),90,IF(AND(I8<=250,'Crop Budget (Main)'!G14<=60,H14<=19),105,IF(AND(I8<=250,'Crop Budget (Main)'!G14<=70,H14<=19),120,IF(AND(I8<=250,'Crop Budget (Main)'!G14>70,H14<=19),120"]
[19,280]
[19,300]
[29,100,"IF(AND(I8<=100,'Crop Budget (Main)'!G14<=100,H14<=29),210,IF(AND(I8<=100,'Crop Budget (Main)'!G14<=120,H14<=29),225,IF(AND(I8<=100,'Crop Budget (Main)'!G14<=140,H14<=29),240,IF(AND(I8<=100,'Crop Budget (Main)'!G14<=160,H14<=29),255,IF(AND(I8<=100,'Crop Budget (Main)'!G14<=180,H14<=29),270,IF(AND(I8<=100,'Crop Budget (Main)'!G14>180,H14<=29),270"]
[29,150,"IF(AND(I8<=150,'Crop Budget (Main)'!G14<=100,H14<=29),160,IF(AND(I8<=150,'Crop Budget (Main)'!G14<=120,H14<=29),175,IF(AND(I8<=150,'Crop Budget (Main)'!G14<=140,H14<=29),190,IF(AND(I8<=150,'Crop Budget (Main)'!G14<=160,H14<=29),205,IF(AND(I8<=150,'Crop Budget (Main)'!G14<=180,H14<=29),220,IF(AND(I8<=150,'Crop Budget (Main)'!G14>180,H14<=29),220"]
[29,250,"IF(AND(I8<=250,'Crop Budget (Main)'!G14<=100,H14<=29),110,IF(AND(I8<=250,'Crop Budget (Main)'!G14<=120,H14<=29),125,IF(AND(I8<=250,'Crop Budget (Main)'!G14<=140,H14<=29),140,IF(AND(I8<=250,'Crop Budget (Main)'!G14<=160,H14<=29),155,IF(AND(I8<=250,'Crop Budget (Main)'!G14<=180,H14<=29),170,IF(AND(I8<=250,'Crop Budget (Main)'!G14>180,H14<=29),170"]
[29,310]
[29,330]
[29,350,null,"IF(AND(I8<=50,'Crop Budget (Main)'!G14<=30,H14<=9),140,IF(AND(I8<=50,'Crop Budget (Main)'!G14<=40,H14<=9),155,IF(AND(I8<=50,'Crop Budget (Main)'!G14<=50,H14<=9),170,IF(AND(I8<=50,'Crop Budget (Main)'!G14<=60,H14<=9),180,IF(AND(I8<=50,'Crop Budget (Main)'!G14<=70,H14<=9),195,IF(AND(I8<=50,'Crop Budget (Main)'!G14>70,H14<=9),195,IF(AND(I8<=100,'Crop Budget (Main)'!G14<=30,H14<=9),110,IF(AND(I8<=100,'Crop Budget (Main)'!G14<=40,H14<=9),125,IF(AND(I8<=100,'Crop Budget (Main)'!G14<=50,H14<=9),135,IF(AND(I8<=100,'Crop Budget (Main)'!G14<=60,H14<=9),150,IF(AND(I8<=100,'Crop Budget (Main)'!G14<=70,H14<=9),165,IF(AND(I8<=100,'Crop Budget (Main)'!G14>70,H14<=9),165,IF(AND(I8<=150,'Crop Budget (Main)'!G14<=30,H14<=9),80,IF(AND(I8<=150,'Crop Budget (Main)'!G14<=40,H14<=9),90,IF(AND(I8<=150,'Crop Budget (Main)'!G14<=50,H14<=9),105,IF(AND(I8<=150,'Crop Budget (Main)'!G14<=60,H14<=9),105,IF(AND(I8<=150,'Crop Budget (Main)'!G14<=70,H14<=9),120,IF(AND(I8<=150,'Crop Budget (Main)'!G14>70,H14<=9),120,IF(AND(I8<=50,'Crop Budget (Main)'!G14<=30,H14<=19),175,IF(AND(I8<=50,'Crop Budget (Main)'!G14<=40,H14<=19),190,IF(AND(I8<=50,'Crop Budget (Main)'!G14<=50,H14<=19),205,IF(AND(I8<=50,'Crop Budget (Main)'!G14<=60,H14<=19),215,IF(AND(I8<=50,'Crop Budget (Main)'!G14<=70,H14<=19),230,IF(AND(I8<=50,'Crop Budget (Main)'!G14>70,H14<=19),230,IF(AND(I8<=100,'Crop Budget (Main)'!G14<=30,H14<=19),135,IF(AND(I8<=100,'Crop Budget (Main)'!G14<=40,H14<=19),150,IF(AND(I8<=100,'Crop Budget (Main)'!G14<=50,H14<=19),165,IF(AND(I8<=100,'Crop Budget (Main)'!G14<=60,H14<=19),180,IF(AND(I8<=100,'Crop Budget (Main)'!G14<=70,H14<=19),195,IF(AND(I8<=100,'Crop Budget (Main)'!G14>70,H14<=19),195,IF(AND(I8<=150,'Crop Budget (Main)'!G14<=30,H14<=19),100,IF(AND(I8<=150,'Crop Budget (Main)'!G14<=40,H14<=19),115,IF(AND(I8<=150,'Crop Budget (Main)'!G14<=50,H14<=19),130,IF(AND(I8<=150,'Crop Budget (Main)'!G14<=60,H14<=19),140,IF(AND(I8<=150,'Crop Budget (Main)'!G14<=70,H14<=19),155,IF(AND(I8<=150,'Crop Budget (Main)'!G14>70,H14<=19),155,IF(AND(I8<=250,'Crop Budget (Main)'!G14<=30,H14<=19),60,IF(AND(I8<=250,'Crop Budget (Main)'!G14<=40,H14<=19),75,IF(AND(I8<=250,'Crop Budget (Main)'!G14<=50,H14<=19),90,IF(AND(I8<=250,'Crop Budget (Main)'!G14<=60,H14<=19),105,IF(AND(I8<=250,'Crop Budget (Main)'!G14<=70,H14<=19),120,IF(AND(I8<=250,'Crop Budget (Main)'!G14>70,H14<=19),120,IF(AND(I8<=100,'Crop Budget (Main)'!G14<=100,H14<=29),210,IF(AND(I8<=100,'Crop Budget (Main)'!G14<=120,H14<=29),225,IF(AND(I8<=100,'Crop Budget (Main)'!G14<=140,H14<=29),240,IF(AND(I8<=100,'Crop Budget (Main)'!G14<=160,H14<=29),255,IF(AND(I8<=100,'Crop Budget (Main)'!G14<=180,H14<=29),270,IF(AND(I8<=100,'Crop Budget (Main)'!G14>180,H14<=29),270,IF(AND(I8<=150,'Crop Budget (Main)'!G14<=100,H14<=29),160,IF(AND(I8<=150,'Crop Budget (Main)'!G14<=120,H14<=29),175,IF(AND(I8<=150,'Crop Budget (Main)'!G14<=140,H14<=29),190,IF(AND(I8<=150,'Crop Budget (Main)'!G14<=160,H14<=29),205,IF(AND(I8<=150,'Crop Budget (Main)'!G14<=180,H14<=29),220,IF(AND(I8<=150,'Crop Budget (Main)'!G14>180,H14<=29),220,IF(AND(I8<=250,'Crop Budget (Main)'!G14<=100,H14<=29),110,IF(AND(I8<=250,'Crop Budget (Main)'!G14<=120,H14<=29),125,IF(AND(I8<=250,'Crop Budget (Main)'!G14<=140,H14<=29),140,IF(AND(I8<=250,'Crop Budget (Main)'!G14<=160,H14<=29),155,IF(AND(I8<=250,'Crop Budget (Main)'!G14<=180,H14<=29),170,IF(AND(I8<=250,'Crop Budget (Main)'!G14>180,H14<=29),170"]
[30,150]
[30,200]
[30,250]
[30,360]
[30,380]
[30,400]

{"sheet":"Wheat K Calculations","index":4,"n_rows":24,"n_cols":4,"rows_kept":24,"cut":false,"hidden":true,"merged":[]}
[9,50,"IF(AND(M8<=50,'Crop Budget (Main)'!K14<=50,L14<=9),115,IF(AND(M8<=50,'Crop Budget (Main)'!K14<=60,L14<=9),130,IF(AND(M8<=50,'Crop Budget (Main)'!K14<=70,L14<=9),125,IF(AND(M8<=50,'Crop Budget (Main)'!K14<=80,L14<=9),130,IF(AND(M8<=50,'Crop Budget (Main)'!K14<=90,L14<=9),130,IF(AND(M8<=50,'Crop Budget (Main)'!K14>90,L14<=9),130"]
[9,100,"IF(AND(M8<=100,'Crop Budget (Main)'!K14<=50,L14<=9),85,IF(AND(M8<=100,'Crop Budget (Main)'!K14<=60,L14<=9),90,IF(AND(M8<=100,'Crop Budget (Main)'!K14<=70,L14<=9),95,IF(AND(M8<=100,'Crop Budget (Main)'!K14<=80,L14<=9),95,IF(AND(M8<=100,'Crop Budget (Main)'!K14<=90,L14<=9),100,IF(AND(M8<=100,'Crop Budget (Main)'!K14>90,L14<=9),100"]
[9,150,"IF(AND(M8<=150,'Crop Budget (Main)'!K14<=50,L14<=9),55,IF(AND(M8<=150,'Crop Budget (Main)'!K14<=60,L14<=9),60,IF(AND(M8<=150,'Crop Budget (Main)'!K14<=70,L14<=9),60,IF(AND(M8<=150,'Crop Budget (Main)'!K14<=80,L14<=9),65,IF(AND(M8<=150,'Crop Budget (Main)'!K14<=90,L14<=9),70,IF(AND(M8<=150,'Crop Budget (Main)'!K14>90,L14<=9),70"]
[9,235]
[9,260]
[9,280]
[19,50,"IF(AND(M8<=50,'Crop Budget (Main)'!K14<=50,L14<=19),150,IF(AND(M8<=50,'Crop Budget (Main)'!K14<=60,L14<=19),155,IF(AND(M8<=50,'Crop Budget (Main)'!K14<=70,L14<=19),160,IF(AND(M8<=50,'Crop Budget (Main)'!K14<=80,L14<=19),160,IF(AND(M8<=50,'Crop Budget (Main)'!K14<=90,L14<=19),165,IF(AND(M8<=50,'Crop Budget (Main)'!K14>90,L14<=19),165"]
[19,100,"IF(AND(M8<=100,'Crop Budget (Main)'!K14<=50,L14<=19),115,IF(AND(M8<=100,'Crop Budget (Main)'!K14<=60,L14<=19),115,IF(AND(M8<=100,'Crop Budget (Main)'!K14<=70,L14<=19),120,IF(AND(M8<=100,'Crop Budget (Main)'!K14<=80,L14<=19),125,IF(AND(M8<=100,'Crop Budget (Main)'!K14<=90,L14<=19),130,IF(AND(M8<=100,'Crop Budget (Main)'!K14>90,L14<=19),130"]
[19,150,"IF(AND(M8<=150,'Crop Budget (Main)'!K14<=50,L14<=19),75,IF(AND(M8<=150,'Crop Budget (Main)'!K14<=60,L14<=19),80,IF(AND(M8<=150,'Crop Budget (Main)'!K14<=70,L14<=19),85,IF(AND(M8<=150,'Crop Budget (Main)'!K14<=80,L14<=19),85,IF(AND(M8<=150,'Crop Budget (Main)'!K14<=90,L14<=19),90,IF(AND(M8<=150,'Crop Budget (Main)'!K14>90,L14<=19),90"]
[19,200,"IF(AND(M8<=200,'Crop Budget (Main)'!K14<=50,L14<=19),40,IF(AND(M8<=200,'Crop Budget (Main)'!K14<=60,L14<=19),40,IF(AND(M8<=200,'Crop Budget (Main)'!K14<=70,L14<=19),45,IF(AND(M8<=200,'Crop Budget (Main)'!K14<=80,L14<=19),50,IF(AND(M8<=200,'Crop Budget (Main)'!K14<=90,L14<=19),50,IF(AND(M8<=200,'Crop Budget (Main)'!K14>90,L14<=19),50"]
[19,280]
[19,300]
[29,100,"IF(AND(M8<=100,'Crop Budget (Main)'!K14<=50,L14<=29),190,IF(AND(M8<=100,'Crop Budget (Main)'!K14<=60,L14<=29),190,IF(AND(M8<=100,'Crop Budget (Main)'!K14<=70,L14<=29),195,IF(AND(M8<=100,'Crop Budget (Main)'!K14<=80,L14<=29),200,IF(AND(M8<=100,'Crop Budget (Main)'!K14<=90,L14<=29),205,IF(AND(M8<=100,'Crop Budget (Main)'!K14>90,L14<=29),205"]
[29,150,"IF(AND(M8<=150,'Crop Budget (Main)'!K14<=50,L14<=29),140,IF(AND(M8<=150,'Crop Budget (Main)'!K14<=60,L14<=29),140,IF(AND(M8<=150,'Crop Budget (Main)'!K14<=70,L14<=29),145,IF(AND(M8<=150,'Crop Budget (Main)'!K14<=80,L14<=29),150,IF(AND(M8<=150,'Crop Budget (Main)'!K14<=90,L14<=29),155,IF(AND(M8<=150,'Crop Budget (Main)'!K14>90,L14<=29),155"]
[29,200,"IF(AND(M8<=200,'Crop Budget (Main)'!K14<=50,L14<=29),90,IF(AND(M8<=200,'Crop Budget (Main)'!K14<=60,L14<=29),90,IF(AND(M8<=200,'Crop Budget (Main)'!K14<=70,L14<=29),95,IF(AND(M8<=200,'Crop Budget (Main)'!K14<=80,L14<=29),100,IF(AND(M8<=200,'Crop Budget (Main)'!K14<=90,L14<=29),105,IF(AND(M8<=200,'Crop Budget (Main)'!K14>90,L14<=29),105"]
[29,310]
[29,330]
[29,350,null,"IF(AND(M8<=50,'Crop Budget (Main)'!K14<=50,L14<=9),115,IF(AND(M8<=50,'Crop Budget (Main)'!K14<=60,L14<=9),130,IF(AND(M8<=50,'Crop Budget (Main)'!K14<=70,L14<=9),125,IF(AND(M8<=50,'Crop Budget (Main)'!K14<=80,L14<=9),130,IF(AND(M8<=50,'Crop Budget (Main)'!K14<=90,L14<=9),130,IF(AND(M8<=50,'Crop Budget (Main)'!K14>90,L14<=9),130,IF(AND(M8<=100,'Crop Budget (Main)'!K14<=50,L14<=9),85,IF(AND(M8<=100,'Crop Budget (Main)'!K14<=60,L14<=9),90,IF(AND(M8<=100,'Crop Budget (Main)'!K14<=70,L14<=9),95,IF(AND(M8<=100,'Crop Budget (Main)'!K14<=80,L14<=9),95,IF(AND(M8<=100,'Crop Budget (Main)'!K14<=90,L14<=9),100,IF(AND(M8<=100,'Crop Budget (Main)'!K14>90,L14<=9),100,IF(AND(M8<=150,'Crop Budget (Main)'!K14<=50,L14<=9),55,IF(AND(M8<=150,'Crop Budget (Main)'!K14<=60,L14<=9),60,IF(AND(M8<=150,'Crop Budget (Main)'!K14<=70,L14<=9),60,IF(AND(M8<=150,'Crop Budget (Main)'!K14<=80,L14<=9),65,IF(AND(M8<=150,'Crop Budget (Main)'!K14<=90,L14<=9),70,IF(AND(M8<=150,'Crop Budget (Main)'!K14>90,L14<=9),70,IF(AND(M8<=50,'Crop Budget (Main)'!K14<=50,L14<=19),150,IF(AND(M8<=50,'Crop Budget (Main)'!K14<=60,L14<=19),155,IF(AND(M8<=50,'Crop Budget (Main)'!K14<=70,L14<=19),160,IF(AND(M8<=50,'Crop Budget (Main)'!K14<=80,L14<=19),160,IF(AND(M8<=50,'Crop Budget (Main)'!K14<=90,L14<=19),165,IF(AND(M8<=50,'Crop Budget (Main)'!K14>90,L14<=19),165,IF(AND(M8<=100,'Crop Budget (Main)'!K14<=50,L14<=19),115,IF(AND(M8<=100,'Crop Budget (Main)'!K14<=60,L14<=19),115,IF(AND(M8<=100,'Crop Budget (Main)'!K14<=70,L14<=19),120,IF(AND(M8<=100,'Crop Budget (Main)'!K14<=80,L14<=19),125,IF(AND(M8<=100,'Crop Budget (Main)'!K14<=90,L14<=19),130,IF(AND(M8<=100,'Crop Budget (Main)'!K14>90,L14<=19),130,IF(AND(M8<=150,'Crop Budget (Main)'!K14<=50,L14<=19),75,IF(AND(M8<=150,'Crop Budget (Main)'!K14<=60,L14<=19),80,IF(AND(M8<=150,'Crop Budget (Main)'!K14<=70,L14<=19),85,IF(AND(M8<=150,'Crop Budget (Main)'!K14<=80,L14<=19),85,IF(AND(M8<=150,'Crop Budget (Main)'!K14<=90,L14<=19),90,IF(AND(M8<=150,'Crop Budget (Main)'!K14>90,L14<=19),90,IF(AND(M8<=200,'Crop Budget (Main)'!K14<=50,L14<=19),40,IF(AND(M8<=200,'Crop Budget (Main)'!K14<=60,L14<=19),40,IF(AND(M8<=200,'Crop Budget (Main)'!K14<=70,L14<=19),45,IF(AND(M8<=200,'Crop Budget (Main)'!K14<=80,L14<=19),50,IF(AND(M8<=200,'Crop Budget (Main)'!K14<=90,L14<=19),50,IF(AND(M8<=200,'Crop Budget (Main)'!K14>90,L14<=19),50,IF(AND(M8<=100,'Crop Budget (Main)'!K14<=50,L14<=29),190,IF(AND(M8<=100,'Crop Budget (Main)'!K14<=60,L14<=29),190,IF(AND(M8<=100,'Crop Budget (Main)'!K14<=70,L14<=29),195,IF(AND(M8<=100,'Crop Budget (Main)'!K14<=80,L14<=29),200,IF(AND(M8<=100,'Crop Budget (Main)'!K14<=90,L14<=29),205,IF(AND(M8<=100,'Crop Budget (Main)'!K14>90,L14<=29),205,IF(AND(M8<=150,'Crop Budget (Main)'!K14<=50,L14<=29),140,IF(AND(M8<=150,'Crop Budget (Main)'!K14<=60,L14<=29),140,IF(AND(M8<=150,'Crop Budget (Main)'!K14<=70,L14<=29),145,IF(AND(M8<=150,'Crop Budget (Main)'!K14<=80,L14<=29),150,IF(AND(M8<=150,'Crop Budget (Main)'!K14<=90,L14<=29),155,IF(AND(M8<=150,'Crop Budget (Main)'!K14>90,L14<=29),155,IF(AND(M8<=200,'Crop Budget (Main)'!K14<=50,L14<=29),90,IF(AND(M8<=200,'Crop Budget (Main)'!K14<=60,L14<=29),90,IF(AND(M8<=200,'Crop Budget (Main)'!K14<=70,L14<=29),95,IF(AND(M8<=200,'Crop Budget (Main)'!K14<=80,L14<=29),100,IF(AND(M8<=200,'Crop Budget (Main)'!K14<=90,L14<=29),105,IF(AND(M8<=200,'Crop Budget (Main)'!K14>90,L14<=29),105"]
[30,150]
[30,200]
[30,250]
[30,360]
[30,380]
[30,400]

{"sheet":"Fertilizer Products & Pricing","index":5,"n_rows":81,"n_cols":25,"rows_kept":81,"cut":false,"hidden":false,"merged":[[30,20,30,24],[27,20,28,24],[4,20,6,22],[1,1,1,9],[42,20,45,24],[31,24,32,24],[36,24,37,24]]}
[1,2,3,4,5,6,7,8,9,10,11,12,13,14,15,16,17,18]
[null,"Pounds per Material",null,null,null,null,null,null,null,null,null,null,null,null,null,null,null,"(Enter Below)"]
["Macronutrients","Nitrogen","Phosphorus","Potassium","Sulfur","Magnesium","Calcium","Zinc","Boron","Manganese","Copper","Molybdenum","Iron","Unit Size","App Units","Units/Pkg","Purchase Units","Price/Unit"]
["None",null,null,null,null,null,null,null,null,null,null,null,null,null,null,1,"None",0]
["Ammonium polyphosphate (10-34-0)",{"$f":"N5*0.1","v":1.17},{"$f":"N5*0.34","v":3.9780000000000002},null,null,null,null,null,null,null,null,null,null,11.7,"gal",2000,"Tons",0,null,"Note:","All listed product values are based on nutrient analysis from product labels"]
["AMS (21-0-0-24S)",0.21,null,null,0.24,null,null,null,null,null,null,null,null,1,"lbs",2000,"Tons",0]
["Anhydrous (82-0-0)",0.82,null,null,null,null,null,null,null,null,null,null,null,1,"lbs",2000,"Tons",0]
["DAP (18-46-0)",0.18,0.46,null,null,null,null,null,null,null,null,null,null,1,"lbs",2000,"Tons",0]
["ESN (44-0-0)",0.44,null,null,null,null,null,null,null,null,null,null,null,1,"lbs",2000,"Tons",0]
["Gypsum (0-0-0-17S-21Ca)",null,null,null,0.17,null,0.21,null,null,null,null,null,null,1,"lbs",2000,"Tons",0]
["K-Mag (0-0-22-11Mg-21S)",null,null,0.22,0.21,0.11,null,null,null,null,null,null,null,1,"lbs",2000,"Gallons",0]
["MAP (11-52-00)",0.11,0.52,null,null,null,null,null,null,null,null,null,null,1,"lbs",2000,"Tons",0]
["MESZ (12-40-0-10S-1Z)",0.12,0.4,null,0.1,null,null,0.01,null,null,null,null,null,1,"lbs",2000,"Tons",0]
["Potash (0-0-60)",null,null,0.6,null,null,null,null,null,null,null,null,null,1,"lbs",2000,"Tons",0]
["Potassium Acetate (0-0-24)",null,null,0.24,null,null,null,null,null,null,null,null,null,10.65,"gal",2000,"Gallons",0]
["Potassium Sulphate (0-0-52-18S)",null,null,0.52,0.18,null,null,null,null,null,null,null,null,1,"lbs",2000,"Tons",0]
["SuperU (46-0-0)",0.46,null,null,null,null,null,null,null,null,null,null,null,1,"lbs",2000,"Tons",0]
["Thiosul (12-0-0-26)",{"$f":"N18*0.12","v":1.3247999999999998},null,null,{"$f":"N18*0.26","v":2.8704000000000001},null,null,null,null,null,null,null,null,11.04,"gal",2000,"Tons",0]
["Triple Superphosphate (0-46-0)",null,0.46,null,null,null,null,null,null,null,null,null,null,1,"lbs",2000,"Tons",0]
["UAN 28% (28-0-0)",{"$f":"N20*0.28","v":2.9876000000000005},null,null,null,null,null,null,null,null,null,null,null,10.67,"gal",2000,"Tons",0]
["UAN 32% (32-0-0)",{"$f":"N21*0.32","v":3.5392000000000001},null,null,null,null,null,null,null,null,null,null,null,11.06,"gal",2000,"Tons",0]
["Urea (46-0-0)",{"$f":"0.46","v":0.46},null,null,null,null,null,null,null,null,null,null,null,1,"lbs",2000,"Tons",0]
["9-18-9 (liquid)",0.98730000000000007,1.9746000000000001,0.98730000000000007,null,null,null,null,null,null,null,null,null,1,"gal",1,"Gallons",0,null,null,"Manure Resources"]
["6-24-6 (liquid)",0.66539999999999999,2.6616,0.66539999999999999,null,null,null,null,null,null,null,null,null,1,"gal",1,"Gallons",0,null,null,"Manure application methods and nitrogen losses (University of Minnesota)"]
["6-12-12 (dry)",0.06,0.12,0.12,null,null,null,null,null,null,null,null,null,1,"lbs",2000,"Tons",0,null,null,"Michigan GAAMPS",null,"←  See table A4 in Manure Mgmt & Utilization section for approximate manure values in place of nutrient analysis"]
["5-10-5 (dry)",0.05,0.1,0.05,null,null,null,null,null,null,null,null,null,1,"lbs",2000,"Tons",0]
["3-18-18 (liquid)",0.35099999999999998,2.1059999999999999,2.1059999999999999,null,null,null,null,null,null,null,null,null,1,"gal",1,"Gallons",0,null,null,"Note:"]
["19-19-19 (dry)",0.19,0.19,0.19,null,null,null,null,null,null,null,null,null,1,"lbs",2000,"Tons",0,null,null,"If you are using manure or compost, for best results a nutrient analysis is highly recommended."]
["15-15-2 (liquid)",1.738,1.65,0.22,null,null,null,null,null,null,null,null,null,1,"gal",1,"Gallons",0]
["15-15-15 (dry)",0.15,0.15,0.15,null,null,null,null,null,null,null,null,null,1,"lbs",2000,"Tons",0]
["12-24-24 (dry)",0.12,0.24,0.24,null,null,null,null,null,null,null,null,null,1,"lbs",2000,"Tons",0,null,null,"Manure Calculator"]
["10-10-10 (dry)",0.1,0.1,0.1,null,null,null,null,null,null,null,null,null,1,"lbs",2000,"Tons",0,null,null,"Manure (Solid)",null,null,null,"Days of Incorporation %"]
["Manure (solid)",{"$f":"U35","v":0},{"$f":"V35","v":0},{"$f":"W35","v":0},{"$f":"X35","v":0},null,null,null,null,null,null,null,null,2000,"Tons",2000,"Tons",0,"calculator →",null,"N","P","K","S"]
["Manure (liquid)",{"$f":"U40","v":0},{"$f":"V40","v":0},{"$f":"W40","v":0},{"$f":"X40","v":0},null,null,null,null,null,null,null,null,1,"1,000 gal",1,"Gallons",0,"calculator →",null,0,0,0,0,">7 days"]
["Compost",0,0,0,0,0,0,0,0,0,0,0,0,0,0,0,"Enter",0,null,null,{"$f":"'Manure and Nutrient Credits'!E38","v":0},{"$f":"'Manure and Nutrient Credits'!F38","v":0},{"$f":"'Manure and Nutrient Credits'!G38","v":0},{"$f":"'Manure and Nutrient Credits'!H38","v":0},"←Incorporation Adjustment"]
["Enter",0,0,0,0,0,0,0,0,0,0,0,0,0,0,0,"Enter",0]
["Enter",0,0,0,0,0,0,0,0,0,0,0,0,0,0,0,"Enter",0,null,null,"Manure (Liquid)",null,null,null,"Days of Incorporation %"]
["Enter",0,0,0,0,0,0,0,0,0,0,0,0,0,0,0,"Enter",0,null,null,"N","P","K","S"]
["Enter",0,0,0,0,0,0,0,0,0,0,0,0,0,0,0,"Enter",0,null,null,0,0,0,0,">7 days"]
[null,null,null,null,null,null,null,null,null,null,null,null,null,null,null,null,null,null,null,null,{"$f":"'Manure and Nutrient Credits'!E41","v":0},{"$f":"'Manure and Nutrient Credits'!F41","v":0},{"$f":"'Manure and Nutrient Credits'!G41","v":0},{"$f":"'Manure and Nutrient Credits'!H41","v":0},"←Incorporation Adjustment"]
[]
["Micronutrients","Nitrogen","Phosphorus","Potassium","Sulfur","Magnesium","Calcium","Zinc","Boron","Manganese","Copper","Molybdenum","Iron","Unit Size","App Units","Units/Pkg","Purchase Units","(Enter Below)"]
["None",null,null,null,null,null,null,null,null,null,null,null,null,null,null,1,"None",0,null,null,"*Do NOT use manure values if already input on Nutrient Management tab.  This will double count values in fertilizer plan."]
["Boron (14.3%)",null,null,null,null,null,null,null,0.14299999999999999,null,null,null,null,1,"lbs",1,"Pound",0]
["Zinc (35.5%)",null,null,null,null,null,null,0.35499999999999998,null,null,null,null,null,1,"lbs",1,"Pound",0]
["Zinc Liquid (12-0-0-12zn)",0.318,null,null,null,null,null,0.318,null,null,null,null,null,1,"qts",4,"Gallons",0]
["Boron Liquid (0-0-0-10B)",null,null,null,null,null,null,null,{"$f":"(11.12*0.25)*0.1","v":0.27799999999999997},null,null,null,null,1,"qts",4,"Gallons",0]
["Manganese Sulfate",null,null,null,0.18,null,null,null,null,0.33,null,null,null,1,"lbs",1,"Pound",0]
["Zinc Sulphate",35.5,null,null,0.185,null,null,null,null,null,null,null,null,1,"lbs",1,"Pound",0]
["Magnesium Sulfate",null,null,null,0.14000000000000001,9.0999999999999998E-2,null,null,null,null,null,null,null,1,"lbs",1,"Pound",0]
["Borosol 10",null,null,null,null,null,null,null,0.1,null,null,null,null,1,"gal",1,"Gallons",0]
["EDTA ZN (9%)",0.04,null,null,null,null,null,0.09,null,null,null,null,null,1,"gal",1,"Gallons",0]
["Enter",0,0,0,0,0,0,0,0,0,0,0,0,0,0,0,"Enter",0]
["Enter",0,0,0,0,0,0,0,0,0,0,0,0,0,0,0,"Enter",0]
["Enter",0,0,0,0,0,0,0,0,0,0,0,0,0,0,0,"Enter",0]
["Enter",0,0,0,0,0,0,0,0,0,0,0,0,0,0,0,"Enter",0]
[]
[]
["Lime","Nitrogen","Phosphorus","Potassium","Sulfur","Magnesium","Calcium","Zinc","Boron","Manganese","Copper","Molybdenum","Iron","Unit Size","App Units","Units/Pkg","Purchase Units","(Enter Below)"]
["None",null,null,null,null,null,null,null,null,null,null,null,null,null,null,1,"None",0]
["Pelleted Lime",null,null,null,null,0.03,0.22,null,null,null,null,null,null,1,"lbs",2000,"Ton",0]
["Sugar Beet Lime",0.55000000000000004,0.01,3.5999999999999999E-3,null,null,29,null,null,null,null,null,null,1,"tons",1,"Ton",0]
["Dolometic",null,null,null,null,11,42,null,null,null,null,null,null,1,"tons",1,"Ton",0]
["High Calcium",null,null,null,null,null,80,null,null,null,null,null,null,1,"tons",1,"Ton",0]
["Enter",0,0,0,0,0,0,0,0,0,0,0,0,0,0,0,"Enter",0]
["Enter",0,0,0,0,0,0,0,0,0,0,0,0,0,0,0,"Enter",0]
["Enter",0,0,0,0,0,0,0,0,0,0,0,0,0,0,0,"Enter",0]
["Enter",0,0,0,0,0,0,0,0,0,0,0,0,0,0,0,"Enter",0]
[]
[]
["Nitrogen Stabilizers",null,null,null,null,null,null,null,null,null,null,null,null,"Unit Size","App Units","Units/Pkg","Purchase Units","(Enter Below)"]
["None",null,null,null,null,null,null,null,null,null,null,null,null,null,null,1,"None",0]
["N-Serve",null,null,null,null,null,null,null,null,null,null,null,null,1,"ozs",128,"Gallons",0]
["Instinct",null,null,null,null,null,null,null,null,null,null,null,null,1,"ozs",128,"Gallons",0]
["Factor",null,null,null,null,null,null,null,null,null,null,null,null,1,"qt/ton",4,"Gallons",0]
["Nutrisphere",null,null,null,null,null,null,null,null,null,null,null,null,1,"qt/ton",4,"Gallons",0]
["Agrotain",null,null,null,null,null,null,null,null,null,null,null,null,1,"qt/ton",4,"Gallons",0]
["Enter",null,null,null,null,null,null,null,null,null,null,null,null,0,0,0,"Enter",0]
["Enter",null,null,null,null,null,null,null,null,null,null,null,null,0,0,0,"Enter",0]
["Enter",null,null,null,null,null,null,null,null,null,null,null,null,0,0,0,"Enter",0]
["Enter",null,null,null,null,null,null,null,null,null,null,null,null,0,0,0,"Enter",0]

{"sheet":"Manure and Nutrient Credits","index":6,"n_rows":41,"n_cols":12,"rows_kept":41,"cut":false,"hidden":true,"merged":[]}
[]
[]
["Select Previous Crop",0,null,null,null,null,null,null,null,null,null,"Select Option Below"]
["Alfalfa, established",40,null,null,null,null,null,null,null,null,null,"Nutrient Removal"]
["Alfalfa, seeding",40,null,null,null,null,null,null,null,null,null,"Soil Test Based Recs"]
["Clover, established",40]
["Clover, seeding",20]
["Trefoil, established",40]
["Barley + legume",30]
["Oats + legume",30]
["Wheat + legume",30]
["Clover-grass hay",40]
["Grass hay",40]
["Dry edible beans",20]
["Soybeans",30]
["CRP land",40]
[]
[]
[]
[]
[]
[]
[]
["Nutrient Management"]
["Days Before Incorporation","Retention Factor",null,"Manure Nitrogen Multiplier (corn)"]
["----",1,null,"Factor","Nitrogen","Phosphorus","Potassium","Sulfur"]
["0-1 days",0.7,null,{"$f":"VLOOKUP('Nutrient Management'!D37,'Manure and Nutrient Credits'!A26:B30,2,FALSE)","v":1},{"$f":"$D$27*'Nutrient Management'!B34","v":0},{"$f":"$D$27*'Nutrient Management'!C34","v":0},{"$f":"$D$27*'Nutrient Management'!D34","v":0},{"$f":"$D$27*'Nutrient Management'!B36","v":0}]
["2-3 days",0.4,null,"Manure Nitrogen Multiplier (soybeans)"]
["4-7 days",0.2]
[">7 days",0.1,null,{"$f":"VLOOKUP('Nutrient Management'!H37,A26:B30,2,FALSE)","v":1},{"$f":"$D$30*'Nutrient Management'!F34","v":0},{"$f":"$D$30*'Nutrient Management'!G34","v":0},{"$f":"$D$30*'Nutrient Management'!H34","v":0},{"$f":"$D$30*'Nutrient Management'!F36","v":0}]
[null,null,null,"Manure Nitrogen Multiplier (wheat)"]
[]
[null,null,null,{"$f":"VLOOKUP('Nutrient Management'!L37,A26:B30,2,FALSE)","v":1},{"$f":"$D$33*'Nutrient Management'!J34","v":0},{"$f":"$D$33*'Nutrient Management'!K34","v":0},{"$f":"$D$33*'Nutrient Management'!L34","v":0},{"$f":"$D$33*'Nutrient Management'!J36","v":0}]
[]
["Fertilizer Products & Pricing"]
["Days Before Incorporation","Retention Factor",null,"Manure (solid)"]
["----",1,null,"Factor","Nitrogen","Phosphorus","Potassium","Sulfur"]
["0-1 days",0.7,null,{"$f":"VLOOKUP('Fertilizer Products & Pricing'!Y34,'Manure and Nutrient Credits'!A37:B41,2,FALSE)","v":0.1},{"$f":"$D$38*'Fertilizer Products & Pricing'!U34","v":0},{"$f":"$D$38*'Fertilizer Products & Pricing'!V34","v":0},{"$f":"$D$38*'Fertilizer Products & Pricing'!W34","v":0},{"$f":"$D$38*'Fertilizer Products & Pricing'!X34","v":0}]
["2-3 days",0.4,null,"Manure (liquid)"]
["4-7 days",0.2]
[">7 days",0.1,null,{"$f":"VLOOKUP('Fertilizer Products & Pricing'!Y39,'Manure and Nutrient Credits'!A37:B41,2,FALSE)","v":0.1},{"$f":"$D$41*'Fertilizer Products & Pricing'!U39","v":0},{"$f":"$D$41*'Fertilizer Products & Pricing'!V39","v":0},{"$f":"$D$41*'Fertilizer Products & Pricing'!W39","v":0},{"$f":"$D$41*'Fertilizer Products & Pricing'!X39","v":0}]

{"sheet":"Fertilizer Plan (Alfalfa)","index":7,"n_rows":123,"n_cols":35,"rows_kept":123,"cut":false,"hidden":false,"merged":[[25,23,68,23],[0,0,0,10],[68,0,68,10],[2,0,2,10],[1,0,1,10],[1,12,1,22],[26,0,26,10],[47,0,47,10],[26,12,26,22],[47,12,47,22],[89,0,89,10],[0,12,0,22],[2,12,2,22],[68,12,68,22],[89,12,89,22],[16,8,21,10],[16,20,21,22],[0,24,0,34],[2,24,2,34],[68,24,68,34],[89,24,89,34],[1,24,1,34],[26,24,26,34],[47,24,47,34],[16,32,21,34],[112,4,112,6],[113,8,113,10],[113,32,113,34],[113,20,113,22],[113,5,113,6],[112,16,112,18],[113,17,113,18],[112,28,112,30],[113,29,113,30]]}
["Alfalfa",null,null,null,null,null,null,null,null,null,null,null,"Alfalfa",null,null,null,null,null,null,null,null,null,null,null,"Alfalfa"]
["Comparison Plan 1",null,null,null,null,null,null,null,null,null,null,null,"Comparison Plan 2",null,null,null,null,null,null,null,null,null,null,null,"Comparison Plan 3"]
["1st Application (i.e., Pre-Plant or Broadcast Fertilizer)",null,null,null,null,null,null,null,null,null,null,null,"1st Application (i.e., Pre-Plant or Broadcast Fertilizer)",null,null,null,null,null,null,null,null,null,null,null,"1st Application (i.e., Pre-Plant or Broadcast Fertilizer)"]
["Fertilizer Source","Purchase Units","Package Price (Gals, Lbs, etc.)","Units/Pkg","Rate/Acre","Units","Cost",null,null,null,null,null,"Fertilizer Source","Purchase Units","Package Price (Gals, Lbs, etc.)","Units/Pkg","Rate/Acre","Units","Cost",null,null,null,null,null,"Fertilizer Source","Purchase Units","Package Price (Gals, Lbs, etc.)","Units/Pkg","Rate/Acre","Units","Cost"]
["Macronutrients (drop down menu)",null,null,null,"(Enter Below)",null,null,null,"N","P","K",null,"Macronutrients (drop down menu)",null,null,null,"(Enter Below)",null,null,null,"N","P","K",null,"Macronutrients (drop down menu)",null,null,null,"(Enter Below)",null,null,null,"N","P","K"]
["None",{"$f":"VLOOKUP(A6,Macronutrients,14,FALSE)","v":0},{"$f":"VLOOKUP(A6,Macronutrients,18,FALSE)","v":0},{"$f":"VLOOKUP(A6,Macronutrients,16,FALSE)","v":1},0,{"$f":"VLOOKUP(A6,Macronutrients,15,FALSE)","v":0},{"$f":"(E6*VLOOKUP(A6,Macronutrients,14,FALSE)/D6)*C6","v":0},null,{"$f":"VLOOKUP(A6,Macronutrients,2,FALSE)*E6+VLOOKUP(A7,Macronutrients,2,FALSE)*E7+VLOOKUP(A8,Macronutrients,2,FALSE)*E8+VLOOKUP(A9,Macronutrients,2,FALSE)*E9+VLOOKUP(A10,Macronutrients,2,FALSE)*E10+VLOOKUP(A11,Macronutrients,2,FALSE)*E11+VLOOKUP(A14,Micronutrients,2,FALSE)*E14+VLOOKUP(A15,Micronutrients,2,FALSE)*E15+VLOOKUP(A16,Micronutrients,2,FALSE)*E16+VLOOKUP(A17,Micronutrients,2,FALSE)*E17","v":0},{"$f":"VLOOKUP(A6,Macronutrients,3,FALSE)*E6+VLOOKUP(A7,Macronutrients,3,FALSE)*E7+VLOOKUP(A8,Macronutrients,3,FALSE)*E8+VLOOKUP(A9,Macronutrients,3,FALSE)*E9+VLOOKUP(A10,Macronutrients,3,FALSE)*E10+VLOOKUP(A11,Macronutrients,3,FALSE)*E11+VLOOKUP(A14,Micronutrients,3,FALSE)*E14+VLOOKUP(A15,Micronutrients,3,FALSE)*E15+VLOOKUP(A16,Micronutrients,3,FALSE)*E16+VLOOKUP(A17,Micronutrients,3,FALSE)*E17","v":0},{"$f":"VLOOKUP(A6,Macronutrients,4,FALSE)*E6+VLOOKUP(A7,Macronutrients,4,FALSE)*E7+VLOOKUP(A8,Macronutrients,4,FALSE)*E8+VLOOKUP(A9,Macronutrients,4,FALSE)*E9+VLOOKUP(A10,Macronutrients,4,FALSE)*E10+VLOOKUP(A11,Macronutrients,4,FALSE)*E11+VLOOKUP(A14,Micronutrients,4,FALSE)*E14+VLOOKUP(A15,Micronutrients,4,FALSE)*E15+VLOOKUP(A16,Micronutrients,4,FALSE)*E16+VLOOKUP(A17,Micronutrients,4,FALSE)*E17","v":0},null,"None",{"$f":"VLOOKUP(M6,Macronutrients,14,FALSE)","v":0},{"$f":"VLOOKUP(M6,Macronutrients,18,FALSE)","v":0},{"$f":"VLOOKUP(M6,Macronutrients,16,FALSE)","v":1},0,{"$f":"VLOOKUP(M6,Macronutrients,15,FALSE)","v":0},{"$f":"(Q6*VLOOKUP(M6,Macronutrients,14,FALSE)/P6)*O6","v":0},null,{"$f":"VLOOKUP(M6,Macronutrients,2,FALSE)*Q6+VLOOKUP(M7,Macronutrients,2,FALSE)*Q7+VLOOKUP(M8,Macronutrients,2,FALSE)*Q8+VLOOKUP(M9,Macronutrients,2,FALSE)*Q9+VLOOKUP(M10,Macronutrients,2,FALSE)*Q10+VLOOKUP(M11,Macronutrients,2,FALSE)*Q11+VLOOKUP(M14,Micronutrients,2,FALSE)*Q14+VLOOKUP(M15,Micronutrients,2,FALSE)*Q15+VLOOKUP(M16,Micronutrients,2,FALSE)*Q16+VLOOKUP(M17,Micronutrients,2,FALSE)*Q17","v":0},{"$f":"VLOOKUP(M6,Macronutrients,3,FALSE)*Q6+VLOOKUP(M7,Macronutrients,3,FALSE)*Q7+VLOOKUP(M8,Macronutrients,3,FALSE)*Q8+VLOOKUP(M9,Macronutrients,3,FALSE)*Q9+VLOOKUP(M10,Macronutrients,3,FALSE)*Q10+VLOOKUP(M11,Macronutrients,3,FALSE)*Q11+VLOOKUP(M14,Micronutrients,3,FALSE)*Q14+VLOOKUP(M15,Micronutrients,3,FALSE)*Q15+VLOOKUP(M16,Micronutrients,3,FALSE)*Q16+VLOOKUP(M17,Micronutrients,3,FALSE)*Q17","v":0},{"$f":"VLOOKUP(M6,Macronutrients,4,FALSE)*Q6+VLOOKUP(M7,Macronutrients,4,FALSE)*Q7+VLOOKUP(M8,Macronutrients,4,FALSE)*Q8+VLOOKUP(M9,Macronutrients,4,FALSE)*Q9+VLOOKUP(M10,Macronutrients,4,FALSE)*Q10+VLOOKUP(M11,Macronutrients,4,FALSE)*Q11+VLOOKUP(M14,Micronutrients,4,FALSE)*Q14+VLOOKUP(M15,Micronutrients,4,FALSE)*Q15+VLOOKUP(M16,Micronutrients,4,FALSE)*Q16+VLOOKUP(M17,Micronutrients,4,FALSE)*Q17","v":0},null,"None",{"$f":"VLOOKUP(Y6,Macronutrients,14,FALSE)","v":0},{"$f":"VLOOKUP(Y6,Macronutrients,18,FALSE)","v":0},{"$f":"VLOOKUP(Y6,Macronutrients,16,FALSE)","v":1},0,{"$f":"VLOOKUP(Y6,Macronutrients,15,FALSE)","v":0},{"$f":"(AC6*VLOOKUP(Y6,Macronutrients,14,FALSE)/AB6)*AA6","v":0},null,{"$f":"VLOOKUP(Y6,Macronutrients,2,FALSE)*AC6+VLOOKUP(Y7,Macronutrients,2,FALSE)*AC7+VLOOKUP(Y8,Macronutrients,2,FALSE)*AC8+VLOOKUP(Y9,Macronutrients,2,FALSE)*AC9+VLOOKUP(Y10,Macronutrients,2,FALSE)*AC10+VLOOKUP(Y11,Macronutrients,2,FALSE)*AC11+VLOOKUP(Y14,Micronutrients,2,FALSE)*AC14+VLOOKUP(Y15,Micronutrients,2,FALSE)*AC15+VLOOKUP(Y16,Micronutrients,2,FALSE)*AC16+VLOOKUP(Y17,Micronutrients,2,FALSE)*AC17","v":0},{"$f":"VLOOKUP(Y6,Macronutrients,3,FALSE)*AC6+VLOOKUP(Y7,Macronutrients,3,FALSE)*AC7+VLOOKUP(Y8,Macronutrients,3,FALSE)*AC8+VLOOKUP(Y9,Macronutrients,3,FALSE)*AC9+VLOOKUP(Y10,Macronutrients,3,FALSE)*AC10+VLOOKUP(Y11,Macronutrients,3,FALSE)*AC11+VLOOKUP(Y14,Micronutrients,3,FALSE)*AC14+VLOOKUP(Y15,Micronutrients,3,FALSE)*AC15+VLOOKUP(Y16,Micronutrients,3,FALSE)*AC16+VLOOKUP(Y17,Micronutrients,3,FALSE)*AC17","v":0},{"$f":"VLOOKUP(Y6,Macronutrients,4,FALSE)*AC6+VLOOKUP(Y7,Macronutrients,4,FALSE)*AC7+VLOOKUP(Y8,Macronutrients,4,FALSE)*AC8+VLOOKUP(Y9,Macronutrients,4,FALSE)*AC9+VLOOKUP(Y10,Macronutrients,4,FALSE)*AC10+VLOOKUP(Y11,Macronutrients,4,FALSE)*AC11+VLOOKUP(Y14,Micronutrients,4,FALSE)*AC14+VLOOKUP(Y15,Micronutrients,4,FALSE)*AC15+VLOOKUP(Y16,Micronutrients,4,FALSE)*AC16+VLOOKUP(Y17,Micronutrients,4,FALSE)*AC17","v":0}]
["None",{"$f":"VLOOKUP(A7,Macronutrients,14,FALSE)","v":0},0,1,0,0,0,null,null,null,null,null,"None",0,0,1,0,0,0,null,null,null,null,null,"None",{"$f":"VLOOKUP(Y7,Macronutrients,14,FALSE)","v":0},0,1,0,0,0]
["None",0,0,1,0,0,0,null,"S","Ca","Mg",null,"None",0,0,1,0,0,0,null,"S","Ca","Mg",null,"None",0,0,1,0,0,0,null,"S","Ca","Mg"]
["None",0,0,1,0,0,0,null,{"$f":"VLOOKUP(A6,Macronutrients,5,FALSE)*E6+VLOOKUP(A7,Macronutrients,5,FALSE)*E7+VLOOKUP(A8,Macronutrients,5,FALSE)*E8+VLOOKUP(A9,Macronutrients,5,FALSE)*E9+VLOOKUP(A10,Macronutrients,5,FALSE)*E10+VLOOKUP(A11,Macronutrients,5,FALSE)*E11+VLOOKUP(A14,Micronutrients,5,FALSE)*E14+VLOOKUP(A15,Micronutrients,5,FALSE)*E15+VLOOKUP(A16,Micronutrients,5,FALSE)*E16+VLOOKUP(A17,Micronutrients,5,FALSE)*E17+VLOOKUP(A20,Lime,5,FALSE)*E20","v":0},{"$f":"VLOOKUP(A6,Macronutrients,7,FALSE)*E6+VLOOKUP(A7,Macronutrients,7,FALSE)*E7+VLOOKUP(A8,Macronutrients,7,FALSE)*E8+VLOOKUP(A9,Macronutrients,7,FALSE)*E9+VLOOKUP(A10,Macronutrients,7,FALSE)*E10+VLOOKUP(A11,Macronutrients,7,FALSE)*E11+VLOOKUP(A14,Micronutrients,7,FALSE)*E14+VLOOKUP(A15,Micronutrients,7,FALSE)*E15+VLOOKUP(A16,Micronutrients,7,FALSE)*E16+VLOOKUP(A17,Micronutrients,7,FALSE)*E17+VLOOKUP(A20,Lime,7,FALSE)*E20","v":0},{"$f":"VLOOKUP($A6,Macronutrients,6,FALSE)*$E$6+VLOOKUP($A7,Macronutrients,6,FALSE)*$E$7+VLOOKUP($A8,Macronutrients,6,FALSE)*$E$8+VLOOKUP($A9,Macronutrients,6,FALSE)*$E$9+VLOOKUP($A10,Macronutrients,6,FALSE)*$E$10+VLOOKUP($A11,Macronutrients,6,FALSE)*$E$11+VLOOKUP($A14,Micronutrients,6,FALSE)*$E$14+VLOOKUP($A15,Micronutrients,6,FALSE)*E15+VLOOKUP($A16,Micronutrients,6,FALSE)*$E$16+VLOOKUP($A17,Micronutrients,6,FALSE)*$E$17+VLOOKUP($A20,Lime,6,FALSE)*E20","v":0},null,"None",0,0,1,0,0,0,null,{"$f":"VLOOKUP(M6,Macronutrients,5,FALSE)*Q6+VLOOKUP(M7,Macronutrients,5,FALSE)*Q7+VLOOKUP(M8,Macronutrients,5,FALSE)*Q8+VLOOKUP(M9,Macronutrients,5,FALSE)*Q9+VLOOKUP(M10,Macronutrients,5,FALSE)*Q10+VLOOKUP(M11,Macronutrients,5,FALSE)*Q11+VLOOKUP(M14,Micronutrients,5,FALSE)*Q14+VLOOKUP(M15,Micronutrients,5,FALSE)*Q15+VLOOKUP(M16,Micronutrients,5,FALSE)*Q16+VLOOKUP(M17,Micronutrients,5,FALSE)*Q17+VLOOKUP(M20,Lime,5,FALSE)*Q20","v":0},{"$f":"VLOOKUP(M6,Macronutrients,7,FALSE)*Q6+VLOOKUP(M7,Macronutrients,7,FALSE)*Q7+VLOOKUP(M8,Macronutrients,7,FALSE)*Q8+VLOOKUP(M9,Macronutrients,7,FALSE)*Q9+VLOOKUP(M10,Macronutrients,7,FALSE)*Q10+VLOOKUP(M11,Macronutrients,7,FALSE)*Q11+VLOOKUP(M14,Micronutrients,7,FALSE)*Q14+VLOOKUP(M15,Micronutrients,7,FALSE)*Q15+VLOOKUP(M16,Micronutrients,7,FALSE)*Q16+VLOOKUP(M17,Micronutrients,7,FALSE)*Q17+VLOOKUP(M20,Lime,7,FALSE)*Q20","v":0},{"$f":"VLOOKUP($A6,Macronutrients,6,FALSE)*$E$6+VLOOKUP($A7,Macronutrients,6,FALSE)*$E$7+VLOOKUP($A8,Macronutrients,6,FALSE)*$E$8+VLOOKUP($A9,Macronutrients,6,FALSE)*$E$9+VLOOKUP($A10,Macronutrients,6,FALSE)*$E$10+VLOOKUP($A11,Macronutrients,6,FALSE)*$E$11+VLOOKUP($A14,Micronutrients,6,FALSE)*$E$14+VLOOKUP($A15,Micronutrients,6,FALSE)*Q15+VLOOKUP($A16,Micronutrients,6,FALSE)*$E$16+VLOOKUP($A17,Micronutrients,6,FALSE)*$E$17+VLOOKUP($A20,Lime,6,FALSE)*Q20","v":0},null,"None",0,0,1,0,0,0,null,{"$f":"VLOOKUP(Y6,Macronutrients,5,FALSE)*AC6+VLOOKUP(Y7,Macronutrients,5,FALSE)*AC7+VLOOKUP(Y8,Macronutrients,5,FALSE)*AC8+VLOOKUP(Y9,Macronutrients,5,FALSE)*AC9+VLOOKUP(Y10,Macronutrients,5,FALSE)*AC10+VLOOKUP(Y11,Macronutrients,5,FALSE)*AC11+VLOOKUP(Y14,Micronutrients,5,FALSE)*AC14+VLOOKUP(Y15,Micronutrients,5,FALSE)*AC15+VLOOKUP(Y16,Micronutrients,5,FALSE)*AC16+VLOOKUP(Y17,Micronutrients,5,FALSE)*AC17+VLOOKUP(Y20,Lime,5,FALSE)*AC20","v":0},{"$f":"VLOOKUP(Y6,Macronutrients,7,FALSE)*AC6+VLOOKUP(Y7,Macronutrients,7,FALSE)*AC7+VLOOKUP(Y8,Macronutrients,7,FALSE)*AC8+VLOOKUP(Y9,Macronutrients,7,FALSE)*AC9+VLOOKUP(Y10,Macronutrients,7,FALSE)*AC10+VLOOKUP(Y11,Macronutrients,7,FALSE)*AC11+VLOOKUP(Y14,Micronutrients,7,FALSE)*AC14+VLOOKUP(Y15,Micronutrients,7,FALSE)*AC15+VLOOKUP(Y16,Micronutrients,7,FALSE)*AC16+VLOOKUP(Y17,Micronutrients,7,FALSE)*AC17+VLOOKUP(Y20,Lime,7,FALSE)*AC20","v":0},{"$f":"VLOOKUP($A6,Macronutrients,6,FALSE)*$E$6+VLOOKUP($A7,Macronutrients,6,FALSE)*$E$7+VLOOKUP($A8,Macronutrients,6,FALSE)*$E$8+VLOOKUP($A9,Macronutrients,6,FALSE)*$E$9+VLOOKUP($A10,Macronutrients,6,FALSE)*$E$10+VLOOKUP($A11,Macronutrients,6,FALSE)*$E$11+VLOOKUP($A14,Micronutrients,6,FALSE)*$E$14+VLOOKUP($A15,Micronutrients,6,FALSE)*AC15+VLOOKUP($A16,Micronutrients,6,FALSE)*$E$16+VLOOKUP($A17,Micronutrients,6,FALSE)*$E$17+VLOOKUP($A20,Lime,6,FALSE)*AC20","v":0}]
["None",0,0,1,0,0,0,null,null,null,null,null,"None",0,0,1,0,0,0,null,null,null,null,null,"None",0,0,1,0,0,0]
["None",0,0,1,0,0,0,null,"Z","B","Mn",null,"None",0,0,1,0,0,0,null,"Z","B","Mn",null,"None",0,0,1,0,0,0,null,"Z","B","Mn"]
[null,null,null,null,null,null,null,null,{"$f":"VLOOKUP(A6,Macronutrients,8,FALSE)*E6+VLOOKUP(A7,Macronutrients,8,FALSE)*E7+VLOOKUP(A8,Macronutrients,8,FALSE)*E8+VLOOKUP(A9,Macronutrients,8,FALSE)*E9+VLOOKUP(A10,Macronutrients,8,FALSE)*E10+VLOOKUP(A11,Macronutrients,8,FALSE)*E11+VLOOKUP(A14,Micronutrients,8,FALSE)*E14+VLOOKUP(A15,Micronutrients,8,FALSE)*E15+VLOOKUP(A16,Micronutrients,8,FALSE)*E16+VLOOKUP(A17,Micronutrients,8,FALSE)*E17+VLOOKUP(A20,Lime,8,FALSE)*E20","v":0},{"$f":"VLOOKUP(A6,Macronutrients,9,FALSE)*E6+VLOOKUP(A7,Macronutrients,9,FALSE)*E7+VLOOKUP(A8,Macronutrients,9,FALSE)*E8+VLOOKUP(A9,Macronutrients,9,FALSE)*E9+VLOOKUP(A10,Macronutrients,9,FALSE)*E10+VLOOKUP(A11,Macronutrients,9,FALSE)*E11+VLOOKUP(A14,Micronutrients,9,FALSE)*E14+VLOOKUP(A15,Micronutrients,9,FALSE)*E15+VLOOKUP(A16,Micronutrients,9,FALSE)*E16+VLOOKUP(A17,Micronutrients,9,FALSE)*E17+VLOOKUP(A20,Lime,9,FALSE)*E20","v":0},{"$f":"VLOOKUP(A6,Macronutrients,10,FALSE)*E6+VLOOKUP(A7,Macronutrients,10,FALSE)*E7+VLOOKUP(A8,Macronutrients,10,FALSE)*E8+VLOOKUP(A9,Macronutrients,10,FALSE)*E9+VLOOKUP(A10,Macronutrients,10,FALSE)*E10+VLOOKUP(A11,Macronutrients,10,FALSE)*E11+VLOOKUP(A14,Micronutrients,10,FALSE)*E14+VLOOKUP(A15,Micronutrients,10,FALSE)*E15+VLOOKUP(A16,Micronutrients,10,FALSE)*E16+VLOOKUP(A17,Micronutrients,10,FALSE)*E17+VLOOKUP(A20,Lime,10,FALSE)*E20","v":0},null,null,null,null,null,null,null,null,null,{"$f":"VLOOKUP(M6,Macronutrients,8,FALSE)*Q6+VLOOKUP(M7,Macronutrients,8,FALSE)*Q7+VLOOKUP(M8,Macronutrients,8,FALSE)*Q8+VLOOKUP(M9,Macronutrients,8,FALSE)*Q9+VLOOKUP(M10,Macronutrients,8,FALSE)*Q10+VLOOKUP(M11,Macronutrients,8,FALSE)*Q11+VLOOKUP(M14,Micronutrients,8,FALSE)*Q14+VLOOKUP(M15,Micronutrients,8,FALSE)*Q15+VLOOKUP(M16,Micronutrients,8,FALSE)*Q16+VLOOKUP(M17,Micronutrients,8,FALSE)*Q17+VLOOKUP(M20,Lime,8,FALSE)*Q20","v":0},{"$f":"VLOOKUP(M6,Macronutrients,9,FALSE)*Q6+VLOOKUP(M7,Macronutrients,9,FALSE)*Q7+VLOOKUP(M8,Macronutrients,9,FALSE)*Q8+VLOOKUP(M9,Macronutrients,9,FALSE)*Q9+VLOOKUP(M10,Macronutrients,9,FALSE)*Q10+VLOOKUP(M11,Macronutrients,9,FALSE)*Q11+VLOOKUP(M14,Micronutrients,9,FALSE)*Q14+VLOOKUP(M15,Micronutrients,9,FALSE)*Q15+VLOOKUP(M16,Micronutrients,9,FALSE)*Q16+VLOOKUP(M17,Micronutrients,9,FALSE)*Q17+VLOOKUP(M20,Lime,9,FALSE)*Q20","v":0},{"$f":"VLOOKUP(M6,Macronutrients,10,FALSE)*Q6+VLOOKUP(M7,Macronutrients,10,FALSE)*Q7+VLOOKUP(M8,Macronutrients,10,FALSE)*Q8+VLOOKUP(M9,Macronutrients,10,FALSE)*Q9+VLOOKUP(M10,Macronutrients,10,FALSE)*Q10+VLOOKUP(M11,Macronutrients,10,FALSE)*Q11+VLOOKUP(M14,Micronutrients,10,FALSE)*Q14+VLOOKUP(M15,Micronutrients,10,FALSE)*Q15+VLOOKUP(M16,Micronutrients,10,FALSE)*Q16+VLOOKUP(M17,Micronutrients,10,FALSE)*Q17+VLOOKUP(M20,Lime,10,FALSE)*Q20","v":0},null,null,null,null,null,null,null,null,null,{"$f":"VLOOKUP(Y6,Macronutrients,8,FALSE)*AC6+VLOOKUP(Y7,Macronutrients,8,FALSE)*AC7+VLOOKUP(Y8,Macronutrients,8,FALSE)*AC8+VLOOKUP(Y9,Macronutrients,8,FALSE)*AC9+VLOOKUP(Y10,Macronutrients,8,FALSE)*AC10+VLOOKUP(Y11,Macronutrients,8,FALSE)*AC11+VLOOKUP(Y14,Micronutrients,8,FALSE)*AC14+VLOOKUP(Y15,Micronutrients,8,FALSE)*AC15+VLOOKUP(Y16,Micronutrients,8,FALSE)*AC16+VLOOKUP(Y17,Micronutrients,8,FALSE)*AC17+VLOOKUP(Y20,Lime,8,FALSE)*AC20","v":0},{"$f":"VLOOKUP(Y6,Macronutrients,9,FALSE)*AC6+VLOOKUP(Y7,Macronutrients,9,FALSE)*AC7+VLOOKUP(Y8,Macronutrients,9,FALSE)*AC8+VLOOKUP(Y9,Macronutrients,9,FALSE)*AC9+VLOOKUP(Y10,Macronutrients,9,FALSE)*AC10+VLOOKUP(Y11,Macronutrients,9,FALSE)*AC11+VLOOKUP(Y14,Micronutrients,9,FALSE)*AC14+VLOOKUP(Y15,Micronutrients,9,FALSE)*AC15+VLOOKUP(Y16,Micronutrients,9,FALSE)*AC16+VLOOKUP(Y17,Micronutrients,9,FALSE)*AC17+VLOOKUP(Y20,Lime,9,FALSE)*AC20","v":0},{"$f":"VLOOKUP(Y6,Macronutrients,10,FALSE)*AC6+VLOOKUP(Y7,Macronutrients,10,FALSE)*AC7+VLOOKUP(Y8,Macronutrients,10,FALSE)*AC8+VLOOKUP(Y9,Macronutrients,10,FALSE)*AC9+VLOOKUP(Y10,Macronutrients,10,FALSE)*AC10+VLOOKUP(Y11,Macronutrients,10,FALSE)*AC11+VLOOKUP(Y14,Micronutrients,10,FALSE)*AC14+VLOOKUP(Y15,Micronutrients,10,FALSE)*AC15+VLOOKUP(Y16,Micronutrients,10,FALSE)*AC16+VLOOKUP(Y17,Micronutrients,10,FALSE)*AC17+VLOOKUP(Y20,Lime,10,FALSE)*AC20","v":0}]
["Micronutrients (drop down menu)",null,null,null,null,null,null,null,null,null,null,null,"Micronutrients (drop down menu)",null,null,null,null,null,null,null,null,null,null,null,"Micronutrients (drop down menu)"]
["None",{"$f":"VLOOKUP($A14,Micronutrients,14,FALSE)","v":0},{"$f":"VLOOKUP(A14,Micronutrients,18,FALSE)","v":0},{"$f":"VLOOKUP(A14,Micronutrients,16,FALSE)","v":1},0,{"$f":"VLOOKUP(A14,Micronutrients,15,FALSE)","v":0},{"$f":"(E14*VLOOKUP(A14,Micronutrients,14,FALSE)/D14)*C14","v":0},null,"Cu","Mo","Fe",null,"None",{"$f":"VLOOKUP(M14,Micronutrients,14,FALSE)","v":0},{"$f":"VLOOKUP(M14,Micronutrients,18,FALSE)","v":0},{"$f":"VLOOKUP(M14,Micronutrients,16,FALSE)","v":1},0,{"$f":"VLOOKUP(M14,Micronutrients,15,FALSE)","v":0},{"$f":"(Q14*VLOOKUP(M14,Micronutrients,14,FALSE)/P14)*O14","v":0},null,"Cu","Mo","Fe",null,"None",{"$f":"VLOOKUP(Y14,Micronutrients,14,FALSE)","v":0},{"$f":"VLOOKUP(Y14,Micronutrients,18,FALSE)","v":0},{"$f":"VLOOKUP(Y14,Micronutrients,16,FALSE)","v":1},0,{"$f":"VLOOKUP(Y14,Micronutrients,15,FALSE)","v":0},{"$f":"(AC14*VLOOKUP(Y14,Micronutrients,14,FALSE)/AB14)*AA14","v":0},null,"Cu","Mo","Fe"]
["None",{"$f":"VLOOKUP($A15,Micronutrients,14,FALSE)","v":0},{"$f":"VLOOKUP(A15,Micronutrients,18,FALSE)","v":0},{"$f":"VLOOKUP(A15,Micronutrients,16,FALSE)","v":1},0,{"$f":"VLOOKUP(A15,Micronutrients,15,FALSE)","v":0},{"$f":"(E15*VLOOKUP(A15,Micronutrients,14,FALSE)/D15)*C15","v":0},null,{"$f":"VLOOKUP(A6,Macronutrients,11,FALSE)*E6+VLOOKUP(A7,Macronutrients,11,FALSE)*E7+VLOOKUP(A8,Macronutrients,11,FALSE)*E8+VLOOKUP(A9,Macronutrients,11,FALSE)*E9+VLOOKUP(A10,Macronutrients,11,FALSE)*E10+VLOOKUP(A11,Macronutrients,11,FALSE)*E11+VLOOKUP(A14,Micronutrients,11,FALSE)*E14+VLOOKUP(A15,Micronutrients,11,FALSE)*E15+VLOOKUP(A16,Micronutrients,11,FALSE)*E16+VLOOKUP(A17,Micronutrients,11,FALSE)*E17+VLOOKUP(A20,Lime,11,FALSE)*E20","v":0},{"$f":"VLOOKUP(A6,Macronutrients,12,FALSE)*E6+VLOOKUP(A7,Macronutrients,12,FALSE)*E7+VLOOKUP(A8,Macronutrients,12,FALSE)*E8+VLOOKUP(A9,Macronutrients,12,FALSE)*E9+VLOOKUP(A10,Macronutrients,12,FALSE)*E10+VLOOKUP(A11,Macronutrients,12,FALSE)*E11+VLOOKUP(A14,Micronutrients,12,FALSE)*E14+VLOOKUP(A15,Micronutrients,12,FALSE)*E15+VLOOKUP(A16,Micronutrients,12,FALSE)*E16+VLOOKUP(A17,Micronutrients,12,FALSE)*E17+VLOOKUP(A20,Lime,12,FALSE)*E20","v":0},{"$f":"VLOOKUP(A6,Macronutrients,13,FALSE)*E6+VLOOKUP(A7,Macronutrients,13,FALSE)*E7+VLOOKUP(A8,Macronutrients,13,FALSE)*E8+VLOOKUP(A9,Macronutrients,13,FALSE)*E9+VLOOKUP(A10,Macronutrients,13,FALSE)*E10+VLOOKUP(A11,Macronutrients,13,FALSE)*E11+VLOOKUP(A14,Micronutrients,13,FALSE)*E14+VLOOKUP(A15,Micronutrients,13,FALSE)*E15+VLOOKUP(A16,Micronutrients,13,FALSE)*E16+VLOOKUP(A17,Micronutrients,13,FALSE)*E17+VLOOKUP(A20,Lime,13,FALSE)*E20","v":0},null,"None",{"$f":"VLOOKUP(M15,Micronutrients,14,FALSE)","v":0},{"$f":"VLOOKUP(M15,Micronutrients,18,FALSE)","v":0},{"$f":"VLOOKUP(M15,Micronutrients,16,FALSE)","v":1},0,{"$f":"VLOOKUP(M15,Micronutrients,15,FALSE)","v":0},{"$f":"(Q15*VLOOKUP(M15,Micronutrients,14,FALSE)/P15)*O15","v":0},null,{"$f":"VLOOKUP(M6,Macronutrients,11,FALSE)*Q6+VLOOKUP(M7,Macronutrients,11,FALSE)*Q7+VLOOKUP(M8,Macronutrients,11,FALSE)*Q8+VLOOKUP(M9,Macronutrients,11,FALSE)*Q9+VLOOKUP(M10,Macronutrients,11,FALSE)*Q10+VLOOKUP(M11,Macronutrients,11,FALSE)*Q11+VLOOKUP(M14,Micronutrients,11,FALSE)*Q14+VLOOKUP(M15,Micronutrients,11,FALSE)*Q15+VLOOKUP(M16,Micronutrients,11,FALSE)*Q16+VLOOKUP(M17,Micronutrients,11,FALSE)*Q17+VLOOKUP(M20,Lime,11,FALSE)*Q20","v":0},{"$f":"VLOOKUP(M6,Macronutrients,12,FALSE)*Q6+VLOOKUP(M7,Macronutrients,12,FALSE)*Q7+VLOOKUP(M8,Macronutrients,12,FALSE)*Q8+VLOOKUP(M9,Macronutrients,12,FALSE)*Q9+VLOOKUP(M10,Macronutrients,12,FALSE)*Q10+VLOOKUP(M11,Macronutrients,12,FALSE)*Q11+VLOOKUP(M14,Micronutrients,12,FALSE)*Q14+VLOOKUP(M15,Micronutrients,12,FALSE)*Q15+VLOOKUP(M16,Micronutrients,12,FALSE)*Q16+VLOOKUP(M17,Micronutrients,12,FALSE)*Q17+VLOOKUP(M20,Lime,12,FALSE)*Q20","v":0},{"$f":"VLOOKUP(M6,Macronutrients,13,FALSE)*Q6+VLOOKUP(M7,Macronutrients,13,FALSE)*Q7+VLOOKUP(M8,Macronutrients,13,FALSE)*Q8+VLOOKUP(M9,Macronutrients,13,FALSE)*Q9+VLOOKUP(M10,Macronutrients,13,FALSE)*Q10+VLOOKUP(M11,Macronutrients,13,FALSE)*Q11+VLOOKUP(M14,Micronutrients,13,FALSE)*Q14+VLOOKUP(M15,Micronutrients,13,FALSE)*Q15+VLOOKUP(M16,Micronutrients,13,FALSE)*Q16+VLOOKUP(M17,Micronutrients,13,FALSE)*Q17+VLOOKUP(M20,Lime,13,FALSE)*Q20","v":0},null,"None",{"$f":"VLOOKUP(Y15,Micronutrients,14,FALSE)","v":0},{"$f":"VLOOKUP(Y15,Micronutrients,18,FALSE)","v":0},{"$f":"VLOOKUP(Y15,Micronutrients,16,FALSE)","v":1},0,{"$f":"VLOOKUP(Y15,Micronutrients,15,FALSE)","v":0},{"$f":"(AC15*VLOOKUP(Y15,Micronutrients,14,FALSE)/AB15)*AA15","v":0},null,{"$f":"VLOOKUP(Y6,Macronutrients,11,FALSE)*AC6+VLOOKUP(Y7,Macronutrients,11,FALSE)*AC7+VLOOKUP(Y8,Macronutrients,11,FALSE)*AC8+VLOOKUP(Y9,Macronutrients,11,FALSE)*AC9+VLOOKUP(Y10,Macronutrients,11,FALSE)*AC10+VLOOKUP(Y11,Macronutrients,11,FALSE)*AC11+VLOOKUP(Y14,Micronutrients,11,FALSE)*AC14+VLOOKUP(Y15,Micronutrients,11,FALSE)*AC15+VLOOKUP(Y16,Micronutrients,11,FALSE)*AC16+VLOOKUP(Y17,Micronutrients,11,FALSE)*AC17+VLOOKUP(Y20,Lime,11,FALSE)*AC20","v":0},{"$f":"VLOOKUP(Y6,Macronutrients,12,FALSE)*AC6+VLOOKUP(Y7,Macronutrients,12,FALSE)*AC7+VLOOKUP(Y8,Macronutrients,12,FALSE)*AC8+VLOOKUP(Y9,Macronutrients,12,FALSE)*AC9+VLOOKUP(Y10,Macronutrients,12,FALSE)*AC10+VLOOKUP(Y11,Macronutrients,12,FALSE)*AC11+VLOOKUP(Y14,Micronutrients,12,FALSE)*AC14+VLOOKUP(Y15,Micronutrients,12,FALSE)*AC15+VLOOKUP(Y16,Micronutrients,12,FALSE)*AC16+VLOOKUP(Y17,Micronutrients,12,FALSE)*AC17+VLOOKUP(Y20,Lime,12,FALSE)*AC20","v":0},{"$f":"VLOOKUP(Y6,Macronutrients,13,FALSE)*AC6+VLOOKUP(Y7,Macronutrients,13,FALSE)*AC7+VLOOKUP(Y8,Macronutrients,13,FALSE)*AC8+VLOOKUP(Y9,Macronutrients,13,FALSE)*AC9+VLOOKUP(Y10,Macronutrients,13,FALSE)*AC10+VLOOKUP(Y11,Macronutrients,13,FALSE)*AC11+VLOOKUP(Y14,Micronutrients,13,FALSE)*AC14+VLOOKUP(Y15,Micronutrients,13,FALSE)*AC15+VLOOKUP(Y16,Micronutrients,13,FALSE)*AC16+VLOOKUP(Y17,Micronutrients,13,FALSE)*AC17+VLOOKUP(Y20,Lime,13,FALSE)*AC20","v":0}]
["None",{"$f":"VLOOKUP($A16,Micronutrients,14,FALSE)","v":0},{"$f":"VLOOKUP(A16,Micronutrients,18,FALSE)","v":0},{"$f":"VLOOKUP(A16,Micronutrients,16,FALSE)","v":1},0,{"$f":"VLOOKUP(A16,Micronutrients,15,FALSE)","v":0},{"$f":"(E16*VLOOKUP(A16,Micronutrients,14,FALSE)/D16)*C16","v":0},null,null,null,null,null,"None",{"$f":"VLOOKUP(M16,Micronutrients,14,FALSE)","v":0},{"$f":"VLOOKUP(M16,Micronutrients,18,FALSE)","v":0},{"$f":"VLOOKUP(M16,Micronutrients,16,FALSE)","v":1},0,{"$f":"VLOOKUP(M16,Micronutrients,15,FALSE)","v":0},{"$f":"(Q16*VLOOKUP(M16,Micronutrients,14,FALSE)/P16)*O16","v":0},null,null,null,null,null,"None",{"$f":"VLOOKUP(Y16,Micronutrients,14,FALSE)","v":0},{"$f":"VLOOKUP(Y16,Micronutrients,18,FALSE)","v":0},{"$f":"VLOOKUP(Y16,Micronutrients,16,FALSE)","v":1},0,{"$f":"'Nutrient Management'!C69","v":0},{"$f":"(AC16*VLOOKUP(Y16,Micronutrients,14,FALSE)/AB16)*AA16","v":0}]
["None",{"$f":"VLOOKUP($A17,Micronutrients,14,FALSE)","v":0},{"$f":"VLOOKUP(A17,Micronutrients,18,FALSE)","v":0},{"$f":"VLOOKUP(A17,Micronutrients,16,FALSE)","v":1},0,{"$f":"VLOOKUP(A17,Micronutrients,15,FALSE)","v":0},{"$f":"(E17*VLOOKUP(A17,Micronutrients,14,FALSE)/D17)*C17","v":0},null,null,null,null,null,"None",{"$f":"VLOOKUP(M17,Micronutrients,14,FALSE)","v":0},{"$f":"VLOOKUP(M17,Micronutrients,18,FALSE)","v":0},{"$f":"VLOOKUP(M17,Micronutrients,16,FALSE)","v":1},0,{"$f":"VLOOKUP(M17,Micronutrients,15,FALSE)","v":0},{"$f":"(Q17*VLOOKUP(M17,Micronutrients,14,FALSE)/P17)*O17","v":0},null,null,null,null,null,"None",{"$f":"VLOOKUP(Y17,Micronutrients,14,FALSE)","v":0},{"$f":"VLOOKUP(Y17,Micronutrients,18,FALSE)","v":0},{"$f":"VLOOKUP(Y17,Micronutrients,16,FALSE)","v":1},0,{"$f":"VLOOKUP(Y17,Micronutrients,15,FALSE)","v":0},{"$f":"(AC17*VLOOKUP(Y17,Micronutrients,14,FALSE)/AB17)*AA17","v":0}]
[]
["Lime (drop down menu)",null,null,null,null,null,null,null,null,null,null,null,"Lime (drop down menu)",null,null,null,null,null,null,null,null,null,null,null,"Lime (drop down menu)"]
["None",{"$f":"VLOOKUP(A20,Lime,14,FALSE)","v":0},{"$f":"VLOOKUP(A20,Lime,18,FALSE)","v":0},{"$f":"VLOOKUP(A20,Lime,16,FALSE)","v":1},0,{"$f":"VLOOKUP(A20,Lime,15,FALSE)","v":0},{"$f":"(E20*VLOOKUP(A20,Lime,14,FALSE)/D20)*C20","v":0},null,null,null,null,null,"None",{"$f":"VLOOKUP(M20,Lime,14,FALSE)","v":0},{"$f":"VLOOKUP(M20,Lime,18,FALSE)","v":0},{"$f":"VLOOKUP(M20,Lime,16,FALSE)","v":1},0,{"$f":"VLOOKUP(M20,Lime,15,FALSE)","v":0},{"$f":"(Q20*VLOOKUP(M20,Lime,14,FALSE)/P20)*O20","v":0},null,null,null,null,null,"None",{"$f":"VLOOKUP(Y20,Lime,14,FALSE)","v":0},{"$f":"VLOOKUP(Y20,Lime,18,FALSE)","v":0},{"$f":"VLOOKUP(Y20,Lime,16,FALSE)","v":1},0,{"$f":"VLOOKUP(Y20,Lime,15,FALSE)","v":0},{"$f":"(AC20*VLOOKUP(Y20,Lime,14,FALSE)/AB20)*AA20","v":0}]
[]
["Nitrogen Stabilizers (drop down menu)",null,null,null,null,null,null,null,null,null,null,null,"Nitrogen Stabilizers (drop down menu)",null,null,null,null,null,null,null,null,null,null,null,"Nitrogen Stabilizers (drop down menu)"]
["None",{"$f":"VLOOKUP(A23,NitrogenStabilizers,14,FALSE)","v":0},{"$f":"VLOOKUP(A23,NitrogenStabilizers,18,FALSE)","v":0},{"$f":"VLOOKUP(A23,NitrogenStabilizers,16,FALSE)","v":1},0,{"$f":"VLOOKUP(A23,NitrogenStabilizers,15,FALSE)","v":0},{"$f":"(E23*VLOOKUP(A23,NitrogenStabilizers,14,FALSE)/D23)*C23","v":0},null,null,null,null,null,"None",{"$f":"VLOOKUP(M23,NitrogenStabilizers,14,FALSE)","v":0},{"$f":"VLOOKUP(M23,NitrogenStabilizers,18,FALSE)","v":0},{"$f":"VLOOKUP(M23,NitrogenStabilizers,16,FALSE)","v":1},0,{"$f":"VLOOKUP(M23,NitrogenStabilizers,15,FALSE)","v":0},{"$f":"(Q23*VLOOKUP(M23,NitrogenStabilizers,14,FALSE)/P23)*O23","v":0},null,null,null,null,null,"None",{"$f":"VLOOKUP(Y23,NitrogenStabilizers,14,FALSE)","v":0},{"$f":"VLOOKUP(Y23,NitrogenStabilizers,18,FALSE)","v":0},{"$f":"VLOOKUP(Y23,NitrogenStabilizers,16,FALSE)","v":1},0,{"$f":"VLOOKUP(Y23,NitrogenStabilizers,15,FALSE)","v":0},{"$f":"(AC23*VLOOKUP(Y23,NitrogenStabilizers,14,FALSE)/AB23)*AA23","v":0}]
["None",{"$f":"VLOOKUP(A24,NitrogenStabilizers,14,FALSE)","v":0},{"$f":"VLOOKUP(A24,NitrogenStabilizers,18,FALSE)","v":0},{"$f":"VLOOKUP(A24,NitrogenStabilizers,16,FALSE)","v":1},0,{"$f":"VLOOKUP(A24,NitrogenStabilizers,15,FALSE)","v":0},{"$f":"(E24*VLOOKUP(A24,NitrogenStabilizers,14,FALSE)/D24)*C24","v":0},null,null,null,null,null,"None",{"$f":"VLOOKUP(M24,NitrogenStabilizers,14,FALSE)","v":0},{"$f":"VLOOKUP(M24,NitrogenStabilizers,18,FALSE)","v":0},{"$f":"VLOOKUP(M24,NitrogenStabilizers,16,FALSE)","v":1},0,{"$f":"VLOOKUP(M24,NitrogenStabilizers,15,FALSE)","v":0},{"$f":"(Q24*VLOOKUP(M24,NitrogenStabilizers,14,FALSE)/P24)*O24","v":0},null,null,null,null,null,"None",{"$f":"VLOOKUP(Y24,NitrogenStabilizers,14,FALSE)","v":0},{"$f":"VLOOKUP(Y24,NitrogenStabilizers,18,FALSE)","v":0},{"$f":"VLOOKUP(Y24,NitrogenStabilizers,16,FALSE)","v":1},0,{"$f":"VLOOKUP(Y24,NitrogenStabilizers,15,FALSE)","v":0},{"$f":"(AC24*VLOOKUP(Y24,NitrogenStabilizers,14,FALSE)/AB24)*AA24","v":0}]
["1st Application Fertilizer Cost/Acre",null,null,null,null,null,{"$f":"SUM(G6:G24)","v":0},null,null,null,null,null,"1st Application Fertilizer Cost/Acre",null,null,null,null,null,{"$f":"SUM(S6:S24)","v":0},null,null,null,null,null,"1st Application Fertilizer Cost/Acre",null,null,null,null,null,{"$f":"SUM(AE6:AE24)","v":0}]
[]
["2nd Application (i.e., Starter Fertilizer or Broadcast)",null,null,null,null,null,null,null,null,null,null,null,"2nd Application (i.e., Starter Fertilizer or Broadcast)",null,null,null,null,null,null,null,null,null,null,null,"2nd Application (i.e., Starter Fertilizer or Broadcast)"]
["Fertilizer Source","Purchase Units","Package Price (Gals, Lbs, etc.)","Units/Pkg","Rate/Acre","Units","Cost",null,null,null,null,null,"Fertilizer Source","Purchase Units","Package Price (Gals, Lbs, etc.)","Units/Pkg","Rate/Acre","Units","Cost",null,null,null,null,null,"Fertilizer Source","Purchase Units","Package Price (Gals, Lbs, etc.)","Units/Pkg","Rate/Acre","Units","Cost"]
["Macronutrients (drop down menu)",null,null,null,"(Enter Below)",null,null,null,"N","P","K",null,"Macronutrients (drop down menu)",null,null,null,"(Enter Below)",null,null,null,"N","P","K",null,"Macronutrients (drop down menu)",null,null,null,"(Enter Below)",null,null,null,"N","P","K"]
["None",{"$f":"VLOOKUP(A30,Macronutrients,14,FALSE)","v":0},{"$f":"VLOOKUP(A30,Macronutrients,18,FALSE)","v":0},{"$f":"VLOOKUP(A30,Macronutrients,16,FALSE)","v":1},0,{"$f":"VLOOKUP(A30,Macronutrients,15,FALSE)","v":0},{"$f":"(E30*VLOOKUP(A30,Macronutrients,14,FALSE)/D30)*C30","v":0},null,{"$f":"VLOOKUP(A30,Macronutrients,2,FALSE)*E30+VLOOKUP(A31,Macronutrients,2,FALSE)*E31+VLOOKUP(A32,Macronutrients,2,FALSE)*E32+VLOOKUP(A33,Macronutrients,2,FALSE)*E33+VLOOKUP(A34,Macronutrients,2,FALSE)*E34+VLOOKUP(A35,Macronutrients,2,FALSE)*E35+VLOOKUP(A38,Micronutrients,2,FALSE)*E38+VLOOKUP(A39,Micronutrients,2,FALSE)*E39+VLOOKUP(A40,Micronutrients,2,FALSE)*E40+VLOOKUP(A41,Micronutrients,2,FALSE)*E41","v":0},{"$f":"VLOOKUP(A30,Macronutrients,3,FALSE)*E30+VLOOKUP(A31,Macronutrients,3,FALSE)*E31+VLOOKUP(A32,Macronutrients,3,FALSE)*E32+VLOOKUP(A33,Macronutrients,3,FALSE)*E33+VLOOKUP(A34,Macronutrients,3,FALSE)*E34+VLOOKUP(A35,Macronutrients,3,FALSE)*E35+VLOOKUP(A38,Micronutrients,3,FALSE)*E38+VLOOKUP(A39,Micronutrients,3,FALSE)*E39+VLOOKUP(A40,Micronutrients,3,FALSE)*E40+VLOOKUP(A41,Micronutrients,3,FALSE)*E41","v":0},{"$f":"VLOOKUP(A30,Macronutrients,4,FALSE)*E30+VLOOKUP(A31,Macronutrients,4,FALSE)*E31+VLOOKUP(A32,Macronutrients,4,FALSE)*E32+VLOOKUP(A33,Macronutrients,4,FALSE)*E33+VLOOKUP(A34,Macronutrients,4,FALSE)*E34+VLOOKUP(A35,Macronutrients,4,FALSE)*E35+VLOOKUP(A38,Micronutrients,4,FALSE)*E38+VLOOKUP(A39,Micronutrients,4,FALSE)*E39+VLOOKUP(A40,Micronutrients,4,FALSE)*E40+VLOOKUP(A41,Micronutrients,4,FALSE)*E41","v":0},null,"None",{"$f":"VLOOKUP(M30,Macronutrients,14,FALSE)","v":0},{"$f":"VLOOKUP(M30,Macronutrients,18,FALSE)","v":0},{"$f":"VLOOKUP(M30,Macronutrients,16,FALSE)","v":1},0,{"$f":"VLOOKUP(M30,Macronutrients,15,FALSE)","v":0},{"$f":"(Q30*VLOOKUP(M30,Macronutrients,14,FALSE)/P30)*O30","v":0},null,{"$f":"VLOOKUP(M30,Macronutrients,2,FALSE)*Q30+VLOOKUP(M31,Macronutrients,2,FALSE)*Q31+VLOOKUP(M32,Macronutrients,2,FALSE)*Q32+VLOOKUP(M33,Macronutrients,2,FALSE)*Q33+VLOOKUP(M34,Macronutrients,2,FALSE)*Q34+VLOOKUP(M35,Macronutrients,2,FALSE)*Q35+VLOOKUP(M38,Micronutrients,2,FALSE)*Q38+VLOOKUP(M39,Micronutrients,2,FALSE)*Q39+VLOOKUP(M40,Micronutrients,2,FALSE)*Q40+VLOOKUP(M41,Micronutrients,2,FALSE)*Q41","v":0},{"$f":"VLOOKUP(M30,Macronutrients,3,FALSE)*Q30+VLOOKUP(M31,Macronutrients,3,FALSE)*Q31+VLOOKUP(M32,Macronutrients,3,FALSE)*Q32+VLOOKUP(M33,Macronutrients,3,FALSE)*Q33+VLOOKUP(M34,Macronutrients,3,FALSE)*Q34+VLOOKUP(M35,Macronutrients,3,FALSE)*Q35+VLOOKUP(M38,Micronutrients,3,FALSE)*Q38+VLOOKUP(M39,Micronutrients,3,FALSE)*Q39+VLOOKUP(M40,Micronutrients,3,FALSE)*Q40+VLOOKUP(M41,Micronutrients,3,FALSE)*Q41","v":0},{"$f":"VLOOKUP(M30,Macronutrients,4,FALSE)*Q30+VLOOKUP(M31,Macronutrients,4,FALSE)*Q31+VLOOKUP(M32,Macronutrients,4,FALSE)*Q32+VLOOKUP(M33,Macronutrients,4,FALSE)*Q33+VLOOKUP(M34,Macronutrients,4,FALSE)*Q34+VLOOKUP(M35,Macronutrients,4,FALSE)*Q35+VLOOKUP(M38,Micronutrients,4,FALSE)*Q38+VLOOKUP(M39,Micronutrients,4,FALSE)*Q39+VLOOKUP(M40,Micronutrients,4,FALSE)*Q40+VLOOKUP(M41,Micronutrients,4,FALSE)*Q41","v":0},null,"None",{"$f":"VLOOKUP(Y30,Macronutrients,14,FALSE)","v":0},{"$f":"VLOOKUP(Y30,Macronutrients,18,FALSE)","v":0},{"$f":"VLOOKUP(Y30,Macronutrients,16,FALSE)","v":1},0,{"$f":"VLOOKUP(Y30,Macronutrients,15,FALSE)","v":0},{"$f":"(AC30*VLOOKUP(Y30,Macronutrients,14,FALSE)/AB30)*AA30","v":0},null,{"$f":"VLOOKUP(Y30,Macronutrients,2,FALSE)*AC30+VLOOKUP(Y31,Macronutrients,2,FALSE)*AC31+VLOOKUP(Y32,Macronutrients,2,FALSE)*AC32+VLOOKUP(Y33,Macronutrients,2,FALSE)*AC33+VLOOKUP(Y34,Macronutrients,2,FALSE)*AC34+VLOOKUP(Y35,Macronutrients,2,FALSE)*AC35+VLOOKUP(Y38,Micronutrients,2,FALSE)*AC38+VLOOKUP(Y39,Micronutrients,2,FALSE)*AC39+VLOOKUP(Y40,Micronutrients,2,FALSE)*AC40+VLOOKUP(Y41,Micronutrients,2,FALSE)*AC41","v":0},{"$f":"VLOOKUP(Y30,Macronutrients,3,FALSE)*AC30+VLOOKUP(Y31,Macronutrients,3,FALSE)*AC31+VLOOKUP(Y32,Macronutrients,3,FALSE)*AC32+VLOOKUP(Y33,Macronutrients,3,FALSE)*AC33+VLOOKUP(Y34,Macronutrients,3,FALSE)*AC34+VLOOKUP(Y35,Macronutrients,3,FALSE)*AC35+VLOOKUP(Y38,Micronutrients,3,FALSE)*AC38+VLOOKUP(Y39,Micronutrients,3,FALSE)*AC39+VLOOKUP(Y40,Micronutrients,3,FALSE)*AC40+VLOOKUP(Y41,Micronutrients,3,FALSE)*AC41","v":0},{"$f":"VLOOKUP(Y30,Macronutrients,4,FALSE)*AC30+VLOOKUP(Y31,Macronutrients,4,FALSE)*AC31+VLOOKUP(Y32,Macronutrients,4,FALSE)*AC32+VLOOKUP(Y33,Macronutrients,4,FALSE)*AC33+VLOOKUP(Y34,Macronutrients,4,FALSE)*AC34+VLOOKUP(Y35,Macronutrients,4,FALSE)*AC35+VLOOKUP(Y38,Micronutrients,4,FALSE)*AC38+VLOOKUP(Y39,Micronutrients,4,FALSE)*AC39+VLOOKUP(Y40,Micronutrients,4,FALSE)*AC40+VLOOKUP(Y41,Micronutrients,4,FALSE)*AC41","v":0}]
["None",0,0,1,0,0,0,null,null,null,null,null,"None",0,0,1,0,0,0,null,null,null,null,null,"None",0,0,1,0,0,0]
["None",0,0,1,0,0,0,null,"S","Ca","Mg",null,"None",0,0,1,0,0,0,null,"S","Ca","Mg",null,"None",0,0,1,0,0,0,null,"S","Ca","Mg"]
["None",0,0,1,0,0,0,null,{"$f":"VLOOKUP(A30,Macronutrients,5,FALSE)*E30+VLOOKUP(A31,Macronutrients,5,FALSE)*E31+VLOOKUP(A32,Macronutrients,5,FALSE)*E32+VLOOKUP(A33,Macronutrients,5,FALSE)*E33+VLOOKUP(A34,Macronutrients,5,FALSE)*E34+VLOOKUP(A35,Macronutrients,5,FALSE)*E35+VLOOKUP(A38,Micronutrients,5,FALSE)*E38+VLOOKUP(A39,Micronutrients,5,FALSE)*E39+VLOOKUP(A40,Micronutrients,5,FALSE)*E40+VLOOKUP(A41,Micronutrients,5,FALSE)*E41","v":0},{"$f":"VLOOKUP(A30,Macronutrients,7,FALSE)*E30+VLOOKUP(A31,Macronutrients,7,FALSE)*E31+VLOOKUP(A32,Macronutrients,7,FALSE)*E32+VLOOKUP(A33,Macronutrients,7,FALSE)*E33+VLOOKUP(A34,Macronutrients,7,FALSE)*E34+VLOOKUP(A35,Macronutrients,7,FALSE)*E35+VLOOKUP(A38,Micronutrients,7,FALSE)*E38+VLOOKUP(A39,Micronutrients,7,FALSE)*E39+VLOOKUP(A40,Micronutrients,7,FALSE)*E40+VLOOKUP(A41,Micronutrients,7,FALSE)*E41","v":0},{"$f":"VLOOKUP($A30,Macronutrients,6,FALSE)*$E$6+VLOOKUP($A31,Macronutrients,6,FALSE)*$E$7+VLOOKUP($A32,Macronutrients,6,FALSE)*$E$8+VLOOKUP($A33,Macronutrients,6,FALSE)*$E$9+VLOOKUP($A34,Macronutrients,6,FALSE)*$E$10+VLOOKUP($A35,Macronutrients,6,FALSE)*$E$11+VLOOKUP($A38,Micronutrients,6,FALSE)*$E$14+VLOOKUP($A39,Micronutrients,6,FALSE)*E39+VLOOKUP($A40,Micronutrients,6,FALSE)*$E$16+VLOOKUP($A41,Micronutrients,6,FALSE)*$E$17","v":0},null,"None",0,0,1,0,0,0,null,{"$f":"VLOOKUP(M30,Macronutrients,5,FALSE)*Q30+VLOOKUP(M31,Macronutrients,5,FALSE)*Q31+VLOOKUP(M32,Macronutrients,5,FALSE)*Q32+VLOOKUP(M33,Macronutrients,5,FALSE)*Q33+VLOOKUP(M34,Macronutrients,5,FALSE)*Q34+VLOOKUP(M35,Macronutrients,5,FALSE)*Q35+VLOOKUP(M38,Micronutrients,5,FALSE)*Q38+VLOOKUP(M39,Micronutrients,5,FALSE)*Q39+VLOOKUP(M40,Micronutrients,5,FALSE)*Q40+VLOOKUP(M41,Micronutrients,5,FALSE)*Q41","v":0},{"$f":"VLOOKUP(M30,Macronutrients,7,FALSE)*Q30+VLOOKUP(M31,Macronutrients,7,FALSE)*Q31+VLOOKUP(M32,Macronutrients,7,FALSE)*Q32+VLOOKUP(M33,Macronutrients,7,FALSE)*Q33+VLOOKUP(M34,Macronutrients,7,FALSE)*Q34+VLOOKUP(M35,Macronutrients,7,FALSE)*Q35+VLOOKUP(M38,Micronutrients,7,FALSE)*Q38+VLOOKUP(M39,Micronutrients,7,FALSE)*Q39+VLOOKUP(M40,Micronutrients,7,FALSE)*Q40+VLOOKUP(M41,Micronutrients,7,FALSE)*Q41","v":0},{"$f":"VLOOKUP($A30,Macronutrients,6,FALSE)*$E$6+VLOOKUP($A31,Macronutrients,6,FALSE)*$E$7+VLOOKUP($A32,Macronutrients,6,FALSE)*$E$8+VLOOKUP($A33,Macronutrients,6,FALSE)*$E$9+VLOOKUP($A34,Macronutrients,6,FALSE)*$E$10+VLOOKUP($A35,Macronutrients,6,FALSE)*$E$11+VLOOKUP($A38,Micronutrients,6,FALSE)*$E$14+VLOOKUP($A39,Micronutrients,6,FALSE)*Q39+VLOOKUP($A40,Micronutrients,6,FALSE)*$E$16+VLOOKUP($A41,Micronutrients,6,FALSE)*$E$17","v":0},null,"None",0,0,1,0,0,0,null,{"$f":"VLOOKUP(Y30,Macronutrients,5,FALSE)*AC30+VLOOKUP(Y31,Macronutrients,5,FALSE)*AC31+VLOOKUP(Y32,Macronutrients,5,FALSE)*AC32+VLOOKUP(Y33,Macronutrients,5,FALSE)*AC33+VLOOKUP(Y34,Macronutrients,5,FALSE)*AC34+VLOOKUP(Y35,Macronutrients,5,FALSE)*AC35+VLOOKUP(Y38,Micronutrients,5,FALSE)*AC38+VLOOKUP(Y39,Micronutrients,5,FALSE)*AC39+VLOOKUP(Y40,Micronutrients,5,FALSE)*AC40+VLOOKUP(Y41,Micronutrients,5,FALSE)*AC41","v":0},{"$f":"VLOOKUP(Y30,Macronutrients,7,FALSE)*AC30+VLOOKUP(Y31,Macronutrients,7,FALSE)*AC31+VLOOKUP(Y32,Macronutrients,7,FALSE)*AC32+VLOOKUP(Y33,Macronutrients,7,FALSE)*AC33+VLOOKUP(Y34,Macronutrients,7,FALSE)*AC34+VLOOKUP(Y35,Macronutrients,7,FALSE)*AC35+VLOOKUP(Y38,Micronutrients,7,FALSE)*AC38+VLOOKUP(Y39,Micronutrients,7,FALSE)*AC39+VLOOKUP(Y40,Micronutrients,7,FALSE)*AC40+VLOOKUP(Y41,Micronutrients,7,FALSE)*AC41","v":0},{"$f":"VLOOKUP($A30,Macronutrients,6,FALSE)*$E$6+VLOOKUP($A31,Macronutrients,6,FALSE)*$E$7+VLOOKUP($A32,Macronutrients,6,FALSE)*$E$8+VLOOKUP($A33,Macronutrients,6,FALSE)*$E$9+VLOOKUP($A34,Macronutrients,6,FALSE)*$E$10+VLOOKUP($A35,Macronutrients,6,FALSE)*$E$11+VLOOKUP($A38,Micronutrients,6,FALSE)*$E$14+VLOOKUP($A39,Micronutrients,6,FALSE)*AC39+VLOOKUP($A40,Micronutrients,6,FALSE)*$E$16+VLOOKUP($A41,Micronutrients,6,FALSE)*$E$17","v":0}]
["None",0,0,1,0,0,0,null,null,null,null,null,"None",0,0,1,0,0,0,null,null,null,null,null,"None",0,0,1,0,0,0]
["None",0,0,1,0,0,0,null,"Z","B","Mn",null,"None",0,0,1,0,0,0,null,"Z","B","Mn",null,"None",0,0,1,0,0,0,null,"Z","B","Mn"]
[null,null,null,null,null,null,null,null,{"$f":"VLOOKUP(A30,Macronutrients,8,FALSE)*E30+VLOOKUP(A31,Macronutrients,8,FALSE)*E31+VLOOKUP(A32,Macronutrients,8,FALSE)*E32+VLOOKUP(A33,Macronutrients,8,FALSE)*E33+VLOOKUP(A34,Macronutrients,8,FALSE)*E34+VLOOKUP(A35,Macronutrients,8,FALSE)*E35+VLOOKUP(A38,Micronutrients,8,FALSE)*E38+VLOOKUP(A39,Micronutrients,8,FALSE)*E39+VLOOKUP(A40,Micronutrients,8,FALSE)*E40+VLOOKUP(A41,Micronutrients,8,FALSE)*E41","v":0},{"$f":"VLOOKUP(A30,Macronutrients,9,FALSE)*E30+VLOOKUP(A31,Macronutrients,9,FALSE)*E31+VLOOKUP(A32,Macronutrients,9,FALSE)*E32+VLOOKUP(A33,Macronutrients,9,FALSE)*E33+VLOOKUP(A34,Macronutrients,9,FALSE)*E34+VLOOKUP(A35,Macronutrients,9,FALSE)*E35+VLOOKUP(A38,Micronutrients,9,FALSE)*E38+VLOOKUP(A39,Micronutrients,9,FALSE)*E39+VLOOKUP(A40,Micronutrients,9,FALSE)*E40+VLOOKUP(A41,Micronutrients,9,FALSE)*E41","v":0},{"$f":"VLOOKUP(A30,Macronutrients,10,FALSE)*E30+VLOOKUP(A31,Macronutrients,10,FALSE)*E31+VLOOKUP(A32,Macronutrients,10,FALSE)*E32+VLOOKUP(A33,Macronutrients,10,FALSE)*E33+VLOOKUP(A34,Macronutrients,10,FALSE)*E34+VLOOKUP(A35,Macronutrients,10,FALSE)*E35+VLOOKUP(A38,Micronutrients,10,FALSE)*E38+VLOOKUP(A39,Micronutrients,10,FALSE)*E39+VLOOKUP(A40,Micronutrients,10,FALSE)*E40+VLOOKUP(A41,Micronutrients,10,FALSE)*E41","v":0},null,null,null,null,null,null,null,null,null,{"$f":"VLOOKUP(M30,Macronutrients,8,FALSE)*Q30+VLOOKUP(M31,Macronutrients,8,FALSE)*Q31+VLOOKUP(M32,Macronutrients,8,FALSE)*Q32+VLOOKUP(M33,Macronutrients,8,FALSE)*Q33+VLOOKUP(M34,Macronutrients,8,FALSE)*Q34+VLOOKUP(M35,Macronutrients,8,FALSE)*Q35+VLOOKUP(M38,Micronutrients,8,FALSE)*Q38+VLOOKUP(M39,Micronutrients,8,FALSE)*Q39+VLOOKUP(M40,Micronutrients,8,FALSE)*Q40+VLOOKUP(M41,Micronutrients,8,FALSE)*Q41","v":0},{"$f":"VLOOKUP(M30,Macronutrients,9,FALSE)*Q30+VLOOKUP(M31,Macronutrients,9,FALSE)*Q31+VLOOKUP(M32,Macronutrients,9,FALSE)*Q32+VLOOKUP(M33,Macronutrients,9,FALSE)*Q33+VLOOKUP(M34,Macronutrients,9,FALSE)*Q34+VLOOKUP(M35,Macronutrients,9,FALSE)*Q35+VLOOKUP(M38,Micronutrients,9,FALSE)*Q38+VLOOKUP(M39,Micronutrients,9,FALSE)*Q39+VLOOKUP(M40,Micronutrients,9,FALSE)*Q40+VLOOKUP(M41,Micronutrients,9,FALSE)*Q41","v":0},{"$f":"VLOOKUP(M30,Macronutrients,10,FALSE)*Q30+VLOOKUP(M31,Macronutrients,10,FALSE)*Q31+VLOOKUP(M32,Macronutrients,10,FALSE)*Q32+VLOOKUP(M33,Macronutrients,10,FALSE)*Q33+VLOOKUP(M34,Macronutrients,10,FALSE)*Q34+VLOOKUP(M35,Macronutrients,10,FALSE)*Q35+VLOOKUP(M38,Micronutrients,10,FALSE)*Q38+VLOOKUP(M39,Micronutrients,10,FALSE)*Q39+VLOOKUP(M40,Micronutrients,10,FALSE)*Q40+VLOOKUP(M41,Micronutrients,10,FALSE)*Q41","v":0},null,null,null,null,null,null,null,null,null,{"$f":"VLOOKUP(Y30,Macronutrients,8,FALSE)*AC30+VLOOKUP(Y31,Macronutrients,8,FALSE)*AC31+VLOOKUP(Y32,Macronutrients,8,FALSE)*AC32+VLOOKUP(Y33,Macronutrients,8,FALSE)*AC33+VLOOKUP(Y34,Macronutrients,8,FALSE)*AC34+VLOOKUP(Y35,Macronutrients,8,FALSE)*AC35+VLOOKUP(Y38,Micronutrients,8,FALSE)*AC38+VLOOKUP(Y39,Micronutrients,8,FALSE)*AC39+VLOOKUP(Y40,Micronutrients,8,FALSE)*AC40+VLOOKUP(Y41,Micronutrients,8,FALSE)*AC41","v":0},{"$f":"VLOOKUP(Y30,Macronutrients,9,FALSE)*AC30+VLOOKUP(Y31,Macronutrients,9,FALSE)*AC31+VLOOKUP(Y32,Macronutrients,9,FALSE)*AC32+VLOOKUP(Y33,Macronutrients,9,FALSE)*AC33+VLOOKUP(Y34,Macronutrients,9,FALSE)*AC34+VLOOKUP(Y35,Macronutrients,9,FALSE)*AC35+VLOOKUP(Y38,Micronutrients,9,FALSE)*AC38+VLOOKUP(Y39,Micronutrients,9,FALSE)*AC39+VLOOKUP(Y40,Micronutrients,9,FALSE)*AC40+VLOOKUP(Y41,Micronutrients,9,FALSE)*AC41","v":0},{"$f":"VLOOKUP(Y30,Macronutrients,10,FALSE)*AC30+VLOOKUP(Y31,Macronutrients,10,FALSE)*AC31+VLOOKUP(Y32,Macronutrients,10,FALSE)*AC32+VLOOKUP(Y33,Macronutrients,10,FALSE)*AC33+VLOOKUP(Y34,Macronutrients,10,FALSE)*AC34+VLOOKUP(Y35,Macronutrients,10,FALSE)*AC35+VLOOKUP(Y38,Micronutrients,10,FALSE)*AC38+VLOOKUP(Y39,Micronutrients,10,FALSE)*AC39+VLOOKUP(Y40,Micronutrients,10,FALSE)*AC40+VLOOKUP(Y41,Micronutrients,10,FALSE)*AC41","v":0}]
["Micronutrients (drop down menu)",null,null,null,null,null,null,null,null,null,null,null,"Micronutrients (drop down menu)",null,null,null,null,null,null,null,null,null,null,null,"Micronutrients (drop down menu)"]
["None",{"$f":"VLOOKUP($A38,Micronutrients,14,FALSE)","v":0},{"$f":"VLOOKUP(A38,Micronutrients,18,FALSE)","v":0},{"$f":"VLOOKUP(A38,Micronutrients,16,FALSE)","v":1},0,{"$f":"VLOOKUP(A38,Micronutrients,15,FALSE)","v":0},{"$f":"(E38*VLOOKUP(A38,Micronutrients,14,FALSE)/D38)*C38","v":0},null,"Cu","Mo","Fe",null,"None",{"$f":"VLOOKUP($M38,Micronutrients,14,FALSE)","v":0},{"$f":"VLOOKUP(M38,Micronutrients,18,FALSE)","v":0},{"$f":"VLOOKUP(M38,Micronutrients,16,FALSE)","v":1},0,{"$f":"VLOOKUP(M38,Micronutrients,15,FALSE)","v":0},{"$f":"(Q38*VLOOKUP(M38,Micronutrients,14,FALSE)/P38)*O38","v":0},null,"Cu","Mo","Fe",null,"None",{"$f":"VLOOKUP(Y38,Micronutrients,14,FALSE)","v":0},{"$f":"VLOOKUP(Y38,Micronutrients,18,FALSE)","v":0},{"$f":"VLOOKUP(Y38,Micronutrients,16,FALSE)","v":1},0,{"$f":"VLOOKUP(Y38,Micronutrients,15,FALSE)","v":0},{"$f":"(AC38*VLOOKUP(Y38,Micronutrients,14,FALSE)/AB38)*AA38","v":0},null,"Cu","Mo","Fe"]
["None",{"$f":"VLOOKUP($A39,Micronutrients,14,FALSE)","v":0},{"$f":"VLOOKUP(A39,Micronutrients,18,FALSE)","v":0},{"$f":"VLOOKUP(A39,Micronutrients,16,FALSE)","v":1},0,{"$f":"VLOOKUP(A39,Micronutrients,15,FALSE)","v":0},{"$f":"(E39*VLOOKUP(A39,Micronutrients,14,FALSE)/D39)*C39","v":0},null,{"$f":"VLOOKUP(A30,Macronutrients,11,FALSE)*E30+VLOOKUP(A31,Macronutrients,11,FALSE)*E31+VLOOKUP(A32,Macronutrients,11,FALSE)*E32+VLOOKUP(A33,Macronutrients,11,FALSE)*E33+VLOOKUP(A34,Macronutrients,11,FALSE)*E34+VLOOKUP(A35,Macronutrients,11,FALSE)*E35+VLOOKUP(A38,Micronutrients,11,FALSE)*E38+VLOOKUP(A39,Micronutrients,11,FALSE)*E39+VLOOKUP(A40,Micronutrients,11,FALSE)*E40+VLOOKUP(A41,Micronutrients,11,FALSE)*E41","v":0},{"$f":"VLOOKUP(A30,Macronutrients,12,FALSE)*E30+VLOOKUP(A31,Macronutrients,12,FALSE)*E31+VLOOKUP(A32,Macronutrients,12,FALSE)*E32+VLOOKUP(A33,Macronutrients,12,FALSE)*E33+VLOOKUP(A34,Macronutrients,12,FALSE)*E34+VLOOKUP(A35,Macronutrients,12,FALSE)*E35+VLOOKUP(A38,Micronutrients,12,FALSE)*E38+VLOOKUP(A39,Micronutrients,12,FALSE)*E39+VLOOKUP(A40,Micronutrients,12,FALSE)*E40+VLOOKUP(A41,Micronutrients,12,FALSE)*E41","v":0},{"$f":"VLOOKUP(A30,Macronutrients,13,FALSE)*E30+VLOOKUP(A31,Macronutrients,13,FALSE)*E31+VLOOKUP(A32,Macronutrients,13,FALSE)*E32+VLOOKUP(A33,Macronutrients,13,FALSE)*E33+VLOOKUP(A34,Macronutrients,13,FALSE)*E34+VLOOKUP(A35,Macronutrients,13,FALSE)*E35+VLOOKUP(A38,Micronutrients,13,FALSE)*E38+VLOOKUP(A39,Micronutrients,13,FALSE)*E39+VLOOKUP(A40,Micronutrients,13,FALSE)*E40+VLOOKUP(A41,Micronutrients,13,FALSE)*E41","v":0},null,"None",{"$f":"VLOOKUP($M39,Micronutrients,14,FALSE)","v":0},{"$f":"VLOOKUP(M39,Micronutrients,18,FALSE)","v":0},{"$f":"VLOOKUP(M39,Micronutrients,16,FALSE)","v":1},0,{"$f":"VLOOKUP(M39,Micronutrients,15,FALSE)","v":0},{"$f":"(Q39*VLOOKUP(M39,Micronutrients,14,FALSE)/P39)*O39","v":0},null,{"$f":"VLOOKUP(M30,Macronutrients,11,FALSE)*Q30+VLOOKUP(M31,Macronutrients,11,FALSE)*Q31+VLOOKUP(M32,Macronutrients,11,FALSE)*Q32+VLOOKUP(M33,Macronutrients,11,FALSE)*Q33+VLOOKUP(M34,Macronutrients,11,FALSE)*Q34+VLOOKUP(M35,Macronutrients,11,FALSE)*Q35+VLOOKUP(M38,Micronutrients,11,FALSE)*Q38+VLOOKUP(M39,Micronutrients,11,FALSE)*Q39+VLOOKUP(M40,Micronutrients,11,FALSE)*Q40+VLOOKUP(M41,Micronutrients,11,FALSE)*Q41","v":0},{"$f":"VLOOKUP(M30,Macronutrients,12,FALSE)*Q30+VLOOKUP(M31,Macronutrients,12,FALSE)*Q31+VLOOKUP(M32,Macronutrients,12,FALSE)*Q32+VLOOKUP(M33,Macronutrients,12,FALSE)*Q33+VLOOKUP(M34,Macronutrients,12,FALSE)*Q34+VLOOKUP(M35,Macronutrients,12,FALSE)*Q35+VLOOKUP(M38,Micronutrients,12,FALSE)*Q38+VLOOKUP(M39,Micronutrients,12,FALSE)*Q39+VLOOKUP(M40,Micronutrients,12,FALSE)*Q40+VLOOKUP(M41,Micronutrients,12,FALSE)*Q41","v":0},{"$f":"VLOOKUP(M30,Macronutrients,13,FALSE)*Q30+VLOOKUP(M31,Macronutrients,13,FALSE)*Q31+VLOOKUP(M32,Macronutrients,13,FALSE)*Q32+VLOOKUP(M33,Macronutrients,13,FALSE)*Q33+VLOOKUP(M34,Macronutrients,13,FALSE)*Q34+VLOOKUP(M35,Macronutrients,13,FALSE)*Q35+VLOOKUP(M38,Micronutrients,13,FALSE)*Q38+VLOOKUP(M39,Micronutrients,13,FALSE)*Q39+VLOOKUP(M40,Micronutrients,13,FALSE)*Q40+VLOOKUP(M41,Micronutrients,13,FALSE)*Q41","v":0},null,"None",{"$f":"VLOOKUP(Y39,Micronutrients,14,FALSE)","v":0},{"$f":"VLOOKUP(Y39,Micronutrients,18,FALSE)","v":0},{"$f":"VLOOKUP(Y39,Micronutrients,16,FALSE)","v":1},0,{"$f":"VLOOKUP(Y39,Micronutrients,15,FALSE)","v":0},{"$f":"(AC39*VLOOKUP(Y39,Micronutrients,14,FALSE)/AB39)*AA39","v":0},null,{"$f":"VLOOKUP(Y30,Macronutrients,11,FALSE)*AC30+VLOOKUP(Y31,Macronutrients,11,FALSE)*AC31+VLOOKUP(Y32,Macronutrients,11,FALSE)*AC32+VLOOKUP(Y33,Macronutrients,11,FALSE)*AC33+VLOOKUP(Y34,Macronutrients,11,FALSE)*AC34+VLOOKUP(Y35,Macronutrients,11,FALSE)*AC35+VLOOKUP(Y38,Micronutrients,11,FALSE)*AC38+VLOOKUP(Y39,Micronutrients,11,FALSE)*AC39+VLOOKUP(Y40,Micronutrients,11,FALSE)*AC40+VLOOKUP(Y41,Micronutrients,11,FALSE)*AC41","v":0},{"$f":"VLOOKUP(Y30,Macronutrients,12,FALSE)*AC30+VLOOKUP(Y31,Macronutrients,12,FALSE)*AC31+VLOOKUP(Y32,Macronutrients,12,FALSE)*AC32+VLOOKUP(Y33,Macronutrients,12,FALSE)*AC33+VLOOKUP(Y34,Macronutrients,12,FALSE)*AC34+VLOOKUP(Y35,Macronutrients,12,FALSE)*AC35+VLOOKUP(Y38,Micronutrients,12,FALSE)*AC38+VLOOKUP(Y39,Micronutrients,12,FALSE)*AC39+VLOOKUP(Y40,Micronutrients,12,FALSE)*AC40+VLOOKUP(Y41,Micronutrients,12,FALSE)*AC41","v":0},{"$f":"VLOOKUP(Y30,Macronutrients,13,FALSE)*AC30+VLOOKUP(Y31,Macronutrients,13,FALSE)*AC31+VLOOKUP(Y32,Macronutrients,13,FALSE)*AC32+VLOOKUP(Y33,Macronutrients,13,FALSE)*AC33+VLOOKUP(Y34,Macronutrients,13,FALSE)*AC34+VLOOKUP(Y35,Macronutrients,13,FALSE)*AC35+VLOOKUP(Y38,Micronutrients,13,FALSE)*AC38+VLOOKUP(Y39,Micronutrients,13,FALSE)*AC39+VLOOKUP(Y40,Micronutrients,13,FALSE)*AC40+VLOOKUP(Y41,Micronutrients,13,FALSE)*AC41","v":0}]
["None",{"$f":"VLOOKUP($A40,Micronutrients,14,FALSE)","v":0},{"$f":"VLOOKUP(A40,Micronutrients,18,FALSE)","v":0},{"$f":"VLOOKUP(A40,Micronutrients,16,FALSE)","v":1},0,{"$f":"VLOOKUP(A40,Micronutrients,15,FALSE)","v":0},{"$f":"(E40*VLOOKUP(A40,Micronutrients,14,FALSE)/D40)*C40","v":0},null,null,null,null,null,"None",{"$f":"VLOOKUP($M40,Micronutrients,14,FALSE)","v":0},{"$f":"VLOOKUP(M40,Micronutrients,18,FALSE)","v":0},{"$f":"VLOOKUP(M40,Micronutrients,16,FALSE)","v":1},0,{"$f":"VLOOKUP(M40,Micronutrients,15,FALSE)","v":0},{"$f":"(Q40*VLOOKUP(M40,Micronutrients,14,FALSE)/P40)*O40","v":0},null,null,null,null,null,"None",{"$f":"VLOOKUP(Y40,Micronutrients,14,FALSE)","v":0},{"$f":"VLOOKUP(Y40,Micronutrients,18,FALSE)","v":0},{"$f":"VLOOKUP(Y40,Micronutrients,16,FALSE)","v":1},0,{"$f":"VLOOKUP(Y40,Micronutrients,15,FALSE)","v":0},{"$f":"(AC40*VLOOKUP(Y40,Micronutrients,14,FALSE)/AB40)*AA40","v":0}]
["None",{"$f":"VLOOKUP($A41,Micronutrients,14,FALSE)","v":0},{"$f":"VLOOKUP(A41,Micronutrients,18,FALSE)","v":0},{"$f":"VLOOKUP(A41,Micronutrients,16,FALSE)","v":1},0,{"$f":"VLOOKUP(A41,Micronutrients,15,FALSE)","v":0},{"$f":"(E41*VLOOKUP(A41,Micronutrients,14,FALSE)/D41)*C41","v":0},null,null,null,null,null,"None",{"$f":"VLOOKUP($M41,Micronutrients,14,FALSE)","v":0},{"$f":"VLOOKUP(M41,Micronutrients,18,FALSE)","v":0},{"$f":"VLOOKUP(M41,Micronutrients,16,FALSE)","v":1},0,{"$f":"VLOOKUP(M41,Micronutrients,15,FALSE)","v":0},{"$f":"(Q41*VLOOKUP(M41,Micronutrients,14,FALSE)/P41)*O41","v":0},null,null,null,null,null,"None",{"$f":"VLOOKUP(Y41,Micronutrients,14,FALSE)","v":0},{"$f":"VLOOKUP(Y41,Micronutrients,18,FALSE)","v":0},{"$f":"VLOOKUP(Y41,Micronutrients,16,FALSE)","v":1},0,{"$f":"VLOOKUP(Y41,Micronutrients,15,FALSE)","v":0},{"$f":"(AC41*VLOOKUP(Y41,Micronutrients,14,FALSE)/AB41)*AA41","v":0}]
[]
["Nitrogen Stabilizers (drop down menu)",null,null,null,null,null,null,null,null,null,null,null,"Nitrogen Stabilizers (drop down menu)",null,null,null,null,null,null,null,null,null,null,null,"Nitrogen Stabilizers (drop down menu)"]
["None",{"$f":"VLOOKUP(A44,NitrogenStabilizers,14,FALSE)","v":0},{"$f":"VLOOKUP(A44,NitrogenStabilizers,18,FALSE)","v":0},{"$f":"VLOOKUP(A44,NitrogenStabilizers,16,FALSE)","v":1},0,{"$f":"VLOOKUP(A44,NitrogenStabilizers,15,FALSE)","v":0},{"$f":"(E44*VLOOKUP(A44,NitrogenStabilizers,14,FALSE)/D44)*C44","v":0},null,null,null,null,null,"None",{"$f":"VLOOKUP(M44,NitrogenStabilizers,14,FALSE)","v":0},{"$f":"VLOOKUP(M44,NitrogenStabilizers,18,FALSE)","v":0},{"$f":"VLOOKUP(M44,NitrogenStabilizers,16,FALSE)","v":1},0,{"$f":"VLOOKUP(M44,NitrogenStabilizers,15,FALSE)","v":0},{"$f":"(Q44*VLOOKUP(M44,NitrogenStabilizers,14,FALSE)/P44)*O44","v":0},null,null,null,null,null,"None",{"$f":"VLOOKUP(Y44,NitrogenStabilizers,14,FALSE)","v":0},{"$f":"VLOOKUP(Y44,NitrogenStabilizers,18,FALSE)","v":0},{"$f":"VLOOKUP(Y44,NitrogenStabilizers,16,FALSE)","v":1},0,{"$f":"VLOOKUP(Y44,NitrogenStabilizers,15,FALSE)","v":0},{"$f":"(AC44*VLOOKUP(Y44,NitrogenStabilizers,14,FALSE)/AB44)*AA44","v":0}]
["None",{"$f":"VLOOKUP(A45,NitrogenStabilizers,14,FALSE)","v":0},{"$f":"VLOOKUP(A45,NitrogenStabilizers,18,FALSE)","v":0},{"$f":"VLOOKUP(A45,NitrogenStabilizers,16,FALSE)","v":1},0,{"$f":"VLOOKUP(A45,NitrogenStabilizers,15,FALSE)","v":0},{"$f":"(E45*VLOOKUP(A45,NitrogenStabilizers,14,FALSE)/D45)*C45","v":0},null,null,null,"More",null,"None",{"$f":"VLOOKUP(M45,NitrogenStabilizers,14,FALSE)","v":0},{"$f":"VLOOKUP(M45,NitrogenStabilizers,18,FALSE)","v":0},{"$f":"VLOOKUP(M45,NitrogenStabilizers,16,FALSE)","v":1},0,{"$f":"VLOOKUP(M45,NitrogenStabilizers,15,FALSE)","v":0},{"$f":"(Q45*VLOOKUP(M45,NitrogenStabilizers,14,FALSE)/P45)*O45","v":0},null,null,null,"More",null,"None",{"$f":"VLOOKUP(Y45,NitrogenStabilizers,14,FALSE)","v":0},{"$f":"VLOOKUP(Y45,NitrogenStabilizers,18,FALSE)","v":0},{"$f":"VLOOKUP(Y45,NitrogenStabilizers,16,FALSE)","v":1},0,{"$f":"VLOOKUP(Y45,NitrogenStabilizers,15,FALSE)","v":0},{"$f":"(AC45*VLOOKUP(Y45,NitrogenStabilizers,14,FALSE)/AB45)*AA45","v":0},null,null,null,"More"]
["2nd Application Fertilizer Cost/Acre",null,null,null,null,null,{"$f":"SUM(G30:G45)","v":0},null,null,null,"Below",null,"2nd Application Fertilizer Cost/Acre",null,null,null,null,null,{"$f":"SUM(S30:S45)","v":0},null,null,null,"Below",null,"2nd Application Fertilizer Cost/Acre",null,null,null,null,null,{"$f":"SUM(AE30:AE45)","v":0},null,null,null,"Below"]
[null,null,null,null,null,null,null,null,null,null,"¯",null,null,null,null,null,null,null,null,null,null,null,"¯",null,null,null,null,null,null,null,null,null,null,null,"¯"]
["3rd Application (i.e., Side-Dress or Broadcast or Fertigation)",null,null,null,null,null,null,null,null,null,null,null,"3rd Application (i.e., Side-Dress or Broadcast or Fertigation)",null,null,null,null,null,null,null,null,null,null,null,"3rd Application (i.e., Side-Dress or Broadcast or Fertigation)"]
["Fertilizer Source","Purchase Units","Package Price (Gals, Lbs, etc.)","Units/Pkg","Rate/Acre","Units","Cost",null,null,null,null,null,"Fertilizer Source","Purchase Units","Package Price (Gals, Lbs, etc.)","Units/Pkg","Rate/Acre","Units","Cost",null,null,null,null,null,"Fertilizer Source","Purchase Units","Package Price (Gals, Lbs, etc.)","Units/Pkg","Rate/Acre","Units","Cost"]
["Macronutrients (drop down menu)",null,null,null,"(Enter Below)",null,null,null,"N","P","K",null,"Macronutrients (drop down menu)",null,null,null,"(Enter Below)",null,null,null,"N","P","K",null,"Macronutrients (drop down menu)",null,null,null,"(Enter Below)",null,null,null,"N","P","K"]
["None",{"$f":"VLOOKUP(A51,Macronutrients,14,FALSE)","v":0},{"$f":"VLOOKUP(A51,Macronutrients,18,FALSE)","v":0},{"$f":"VLOOKUP(A51,Macronutrients,16,FALSE)","v":1},0,{"$f":"VLOOKUP(A51,Macronutrients,15,FALSE)","v":0},{"$f":"(E51*VLOOKUP(A51,Macronutrients,14,FALSE)/D51)*C51","v":0},null,{"$f":"VLOOKUP(A51,Macronutrients,2,FALSE)*E51+VLOOKUP(A52,Macronutrients,2,FALSE)*E52+VLOOKUP(A53,Macronutrients,2,FALSE)*E53+VLOOKUP(A54,Macronutrients,2,FALSE)*E54+VLOOKUP(A55,Macronutrients,2,FALSE)*E55+VLOOKUP(A56,Macronutrients,2,FALSE)*E56+VLOOKUP(A59,Micronutrients,2,FALSE)*E59+VLOOKUP(A60,Micronutrients,2,FALSE)*E60+VLOOKUP(A61,Micronutrients,2,FALSE)*E61+VLOOKUP(A62,Micronutrients,2,FALSE)*E62","v":0},{"$f":"VLOOKUP(A51,Macronutrients,3,FALSE)*E51+VLOOKUP(A52,Macronutrients,3,FALSE)*E52+VLOOKUP(A53,Macronutrients,3,FALSE)*E53+VLOOKUP(A54,Macronutrients,3,FALSE)*E54+VLOOKUP(A55,Macronutrients,3,FALSE)*E55+VLOOKUP(A56,Macronutrients,3,FALSE)*E56+VLOOKUP(A59,Micronutrients,3,FALSE)*E59+VLOOKUP(A60,Micronutrients,3,FALSE)*E60+VLOOKUP(A61,Micronutrients,3,FALSE)*E61+VLOOKUP(A62,Micronutrients,3,FALSE)*E62","v":0},{"$f":"VLOOKUP(A51,Macronutrients,4,FALSE)*E51+VLOOKUP(A52,Macronutrients,4,FALSE)*E52+VLOOKUP(A53,Macronutrients,4,FALSE)*E53+VLOOKUP(A54,Macronutrients,4,FALSE)*E54+VLOOKUP(A55,Macronutrients,4,FALSE)*E55+VLOOKUP(A56,Macronutrients,4,FALSE)*E56+VLOOKUP(A59,Micronutrients,4,FALSE)*E59+VLOOKUP(A60,Micronutrients,4,FALSE)*E60+VLOOKUP(A61,Micronutrients,4,FALSE)*E61+VLOOKUP(A62,Micronutrients,4,FALSE)*E62","v":0},null,"None",{"$f":"VLOOKUP(M51,Macronutrients,14,FALSE)","v":0},{"$f":"VLOOKUP(M51,Macronutrients,18,FALSE)","v":0},{"$f":"VLOOKUP(M51,Macronutrients,16,FALSE)","v":1},0,{"$f":"VLOOKUP(M51,Macronutrients,15,FALSE)","v":0},{"$f":"(Q51*VLOOKUP(M51,Macronutrients,14,FALSE)/P51)*O51","v":0},null,{"$f":"VLOOKUP(M51,Macronutrients,2,FALSE)*Q51+VLOOKUP(M52,Macronutrients,2,FALSE)*Q52+VLOOKUP(M53,Macronutrients,2,FALSE)*Q53+VLOOKUP(M54,Macronutrients,2,FALSE)*Q54+VLOOKUP(M55,Macronutrients,2,FALSE)*Q55+VLOOKUP(M56,Macronutrients,2,FALSE)*Q56+VLOOKUP(M59,Micronutrients,2,FALSE)*Q59+VLOOKUP(M60,Micronutrients,2,FALSE)*Q60+VLOOKUP(M61,Micronutrients,2,FALSE)*Q61+VLOOKUP(M62,Micronutrients,2,FALSE)*Q62","v":0},{"$f":"VLOOKUP(M51,Macronutrients,3,FALSE)*Q51+VLOOKUP(M52,Macronutrients,3,FALSE)*Q52+VLOOKUP(M53,Macronutrients,3,FALSE)*Q53+VLOOKUP(M54,Macronutrients,3,FALSE)*Q54+VLOOKUP(M55,Macronutrients,3,FALSE)*Q55+VLOOKUP(M56,Macronutrients,3,FALSE)*Q56+VLOOKUP(M59,Micronutrients,3,FALSE)*Q59+VLOOKUP(M60,Micronutrients,3,FALSE)*Q60+VLOOKUP(M61,Micronutrients,3,FALSE)*Q61+VLOOKUP(M62,Micronutrients,3,FALSE)*Q62","v":0},{"$f":"VLOOKUP(M51,Macronutrients,4,FALSE)*Q51+VLOOKUP(M52,Macronutrients,4,FALSE)*Q52+VLOOKUP(M53,Macronutrients,4,FALSE)*Q53+VLOOKUP(M54,Macronutrients,4,FALSE)*Q54+VLOOKUP(M55,Macronutrients,4,FALSE)*Q55+VLOOKUP(M56,Macronutrients,4,FALSE)*Q56+VLOOKUP(M59,Micronutrients,4,FALSE)*Q59+VLOOKUP(M60,Micronutrients,4,FALSE)*Q60+VLOOKUP(M61,Micronutrients,4,FALSE)*Q61+VLOOKUP(M62,Micronutrients,4,FALSE)*Q62","v":0},null,"None",{"$f":"VLOOKUP(Y51,Macronutrients,14,FALSE)","v":0},{"$f":"VLOOKUP(Y51,Macronutrients,18,FALSE)","v":0},{"$f":"VLOOKUP(Y51,Macronutrients,16,FALSE)","v":1},0,{"$f":"VLOOKUP(Y51,Macronutrients,15,FALSE)","v":0},{"$f":"(AC51*VLOOKUP(Y51,Macronutrients,14,FALSE)/AB51)*AA51","v":0},null,{"$f":"VLOOKUP(Y51,Macronutrients,2,FALSE)*AC51+VLOOKUP(Y52,Macronutrients,2,FALSE)*AC52+VLOOKUP(Y53,Macronutrients,2,FALSE)*AC53+VLOOKUP(Y54,Macronutrients,2,FALSE)*AC54+VLOOKUP(Y55,Macronutrients,2,FALSE)*AC55+VLOOKUP(Y56,Macronutrients,2,FALSE)*AC56+VLOOKUP(Y59,Micronutrients,2,FALSE)*AC59+VLOOKUP(Y60,Micronutrients,2,FALSE)*AC60+VLOOKUP(Y61,Micronutrients,2,FALSE)*AC61+VLOOKUP(Y62,Micronutrients,2,FALSE)*AC62","v":0},{"$f":"VLOOKUP(Y51,Macronutrients,3,FALSE)*AC51+VLOOKUP(Y52,Macronutrients,3,FALSE)*AC52+VLOOKUP(Y53,Macronutrients,3,FALSE)*AC53+VLOOKUP(Y54,Macronutrients,3,FALSE)*AC54+VLOOKUP(Y55,Macronutrients,3,FALSE)*AC55+VLOOKUP(Y56,Macronutrients,3,FALSE)*AC56+VLOOKUP(Y59,Micronutrients,3,FALSE)*AC59+VLOOKUP(Y60,Micronutrients,3,FALSE)*AC60+VLOOKUP(Y61,Micronutrients,3,FALSE)*AC61+VLOOKUP(Y62,Micronutrients,3,FALSE)*AC62","v":0},{"$f":"VLOOKUP(Y51,Macronutrients,4,FALSE)*AC51+VLOOKUP(Y52,Macronutrients,4,FALSE)*AC52+VLOOKUP(Y53,Macronutrients,4,FALSE)*AC53+VLOOKUP(Y54,Macronutrients,4,FALSE)*AC54+VLOOKUP(Y55,Macronutrients,4,FALSE)*AC55+VLOOKUP(Y56,Macronutrients,4,FALSE)*AC56+VLOOKUP(Y59,Micronutrients,4,FALSE)*AC59+VLOOKUP(Y60,Micronutrients,4,FALSE)*AC60+VLOOKUP(Y61,Micronutrients,4,FALSE)*AC61+VLOOKUP(Y62,Micronutrients,4,FALSE)*AC62","v":0}]
["None",0,0,1,0,0,0,null,null,null,null,null,"None",0,0,1,0,0,0,null,null,null,null,null,"None",0,0,1,0,0,0]
["None",0,0,1,0,0,0,null,"S","Ca","Mg",null,"None",0,0,1,0,0,0,null,"S","Ca","Mg",null,"None",0,0,1,0,0,0,null,"S","Ca","Mg"]
["None",0,0,1,0,0,0,null,{"$f":"VLOOKUP(A51,Macronutrients,5,FALSE)*E51+VLOOKUP(A52,Macronutrients,5,FALSE)*E52+VLOOKUP(A53,Macronutrients,5,FALSE)*E53+VLOOKUP(A54,Macronutrients,5,FALSE)*E54+VLOOKUP(A55,Macronutrients,5,FALSE)*E55+VLOOKUP(A56,Macronutrients,5,FALSE)*E56+VLOOKUP(A59,Micronutrients,5,FALSE)*E59+VLOOKUP(A60,Micronutrients,5,FALSE)*E60+VLOOKUP(A61,Micronutrients,5,FALSE)*E61+VLOOKUP(A62,Micronutrients,5,FALSE)*E62","v":0},{"$f":"VLOOKUP(A51,Macronutrients,7,FALSE)*E51+VLOOKUP(A52,Macronutrients,7,FALSE)*E52+VLOOKUP(A53,Macronutrients,7,FALSE)*E53+VLOOKUP(A54,Macronutrients,7,FALSE)*E54+VLOOKUP(A55,Macronutrients,7,FALSE)*E55+VLOOKUP(A56,Macronutrients,7,FALSE)*E56+VLOOKUP(A59,Micronutrients,7,FALSE)*E59+VLOOKUP(A60,Micronutrients,7,FALSE)*E60+VLOOKUP(A61,Micronutrients,7,FALSE)*E61+VLOOKUP(A62,Micronutrients,7,FALSE)*E62","v":0},{"$f":"VLOOKUP($A51,Macronutrients,6,FALSE)*$E$6+VLOOKUP($A52,Macronutrients,6,FALSE)*$E$7+VLOOKUP($A53,Macronutrients,6,FALSE)*$E$8+VLOOKUP($A54,Macronutrients,6,FALSE)*$E$9+VLOOKUP($A55,Macronutrients,6,FALSE)*$E$10+VLOOKUP($A56,Macronutrients,6,FALSE)*$E$11+VLOOKUP($A59,Micronutrients,6,FALSE)*$E$14+VLOOKUP($A60,Micronutrients,6,FALSE)*E60+VLOOKUP($A61,Micronutrients,6,FALSE)*$E$16+VLOOKUP($A62,Micronutrients,6,FALSE)*$E$17","v":0},null,"None",0,0,1,0,0,0,null,{"$f":"VLOOKUP(M51,Macronutrients,5,FALSE)*Q51+VLOOKUP(M52,Macronutrients,5,FALSE)*Q52+VLOOKUP(M53,Macronutrients,5,FALSE)*Q53+VLOOKUP(M54,Macronutrients,5,FALSE)*Q54+VLOOKUP(M55,Macronutrients,5,FALSE)*Q55+VLOOKUP(M56,Macronutrients,5,FALSE)*Q56+VLOOKUP(M59,Micronutrients,5,FALSE)*Q59+VLOOKUP(M60,Micronutrients,5,FALSE)*Q60+VLOOKUP(M61,Micronutrients,5,FALSE)*Q61+VLOOKUP(M62,Micronutrients,5,FALSE)*Q62","v":0},{"$f":"VLOOKUP(M51,Macronutrients,7,FALSE)*Q51+VLOOKUP(M52,Macronutrients,7,FALSE)*Q52+VLOOKUP(M53,Macronutrients,7,FALSE)*Q53+VLOOKUP(M54,Macronutrients,7,FALSE)*Q54+VLOOKUP(M55,Macronutrients,7,FALSE)*Q55+VLOOKUP(M56,Macronutrients,7,FALSE)*Q56+VLOOKUP(M59,Micronutrients,7,FALSE)*Q59+VLOOKUP(M60,Micronutrients,7,FALSE)*Q60+VLOOKUP(M61,Micronutrients,7,FALSE)*Q61+VLOOKUP(M62,Micronutrients,7,FALSE)*Q62","v":0},{"$f":"VLOOKUP($A51,Macronutrients,6,FALSE)*$E$6+VLOOKUP($A52,Macronutrients,6,FALSE)*$E$7+VLOOKUP($A53,Macronutrients,6,FALSE)*$E$8+VLOOKUP($A54,Macronutrients,6,FALSE)*$E$9+VLOOKUP($A55,Macronutrients,6,FALSE)*$E$10+VLOOKUP($A56,Macronutrients,6,FALSE)*$E$11+VLOOKUP($A59,Micronutrients,6,FALSE)*$E$14+VLOOKUP($A60,Micronutrients,6,FALSE)*Q60+VLOOKUP($A61,Micronutrients,6,FALSE)*$E$16+VLOOKUP($A62,Micronutrients,6,FALSE)*$E$17","v":0},null,"None",0,0,1,0,0,0,null,{"$f":"VLOOKUP(Y51,Macronutrients,5,FALSE)*AC51+VLOOKUP(Y52,Macronutrients,5,FALSE)*AC52+VLOOKUP(Y53,Macronutrients,5,FALSE)*AC53+VLOOKUP(Y54,Macronutrients,5,FALSE)*AC54+VLOOKUP(Y55,Macronutrients,5,FALSE)*AC55+VLOOKUP(Y56,Macronutrients,5,FALSE)*AC56+VLOOKUP(Y59,Micronutrients,5,FALSE)*AC59+VLOOKUP(Y60,Micronutrients,5,FALSE)*AC60+VLOOKUP(Y61,Micronutrients,5,FALSE)*AC61+VLOOKUP(Y62,Micronutrients,5,FALSE)*AC62","v":0},{"$f":"VLOOKUP(Y51,Macronutrients,7,FALSE)*AC51+VLOOKUP(Y52,Macronutrients,7,FALSE)*AC52+VLOOKUP(Y53,Macronutrients,7,FALSE)*AC53+VLOOKUP(Y54,Macronutrients,7,FALSE)*AC54+VLOOKUP(Y55,Macronutrients,7,FALSE)*AC55+VLOOKUP(Y56,Macronutrients,7,FALSE)*AC56+VLOOKUP(Y59,Micronutrients,7,FALSE)*AC59+VLOOKUP(Y60,Micronutrients,7,FALSE)*AC60+VLOOKUP(Y61,Micronutrients,7,FALSE)*AC61+VLOOKUP(Y62,Micronutrients,7,FALSE)*AC62","v":0},{"$f":"VLOOKUP($A51,Macronutrients,6,FALSE)*$E$6+VLOOKUP($A52,Macronutrients,6,FALSE)*$E$7+VLOOKUP($A53,Macronutrients,6,FALSE)*$E$8+VLOOKUP($A54,Macronutrients,6,FALSE)*$E$9+VLOOKUP($A55,Macronutrients,6,FALSE)*$E$10+VLOOKUP($A56,Macronutrients,6,FALSE)*$E$11+VLOOKUP($A59,Micronutrients,6,FALSE)*$E$14+VLOOKUP($A60,Micronutrients,6,FALSE)*AC60+VLOOKUP($A61,Micronutrients,6,FALSE)*$E$16+VLOOKUP($A62,Micronutrients,6,FALSE)*$E$17","v":0}]
["None",0,0,1,0,0,0,null,null,null,null,null,"None",0,0,1,0,0,0,null,null,null,null,null,"None",0,0,1,0,0,0]
["None",0,0,1,0,0,0,null,"Z","B","Mn",null,"None",0,0,1,0,0,0,null,"Z","B","Mn",null,"None",0,0,1,0,0,0,null,"Z","B","Mn"]
[null,null,null,null,null,null,null,null,{"$f":"VLOOKUP(A51,Macronutrients,8,FALSE)*E51+VLOOKUP(A52,Macronutrients,8,FALSE)*E52+VLOOKUP(A53,Macronutrients,8,FALSE)*E53+VLOOKUP(A54,Macronutrients,8,FALSE)*E54+VLOOKUP(A55,Macronutrients,8,FALSE)*E55+VLOOKUP(A56,Macronutrients,8,FALSE)*E56+VLOOKUP(A59,Micronutrients,8,FALSE)*E59+VLOOKUP(A60,Micronutrients,8,FALSE)*E60+VLOOKUP(A61,Micronutrients,8,FALSE)*E61+VLOOKUP(A62,Micronutrients,8,FALSE)*E62","v":0},{"$f":"VLOOKUP(A51,Macronutrients,9,FALSE)*E51+VLOOKUP(A52,Macronutrients,9,FALSE)*E52+VLOOKUP(A53,Macronutrients,9,FALSE)*E53+VLOOKUP(A54,Macronutrients,9,FALSE)*E54+VLOOKUP(A55,Macronutrients,9,FALSE)*E55+VLOOKUP(A56,Macronutrients,9,FALSE)*E56+VLOOKUP(A59,Micronutrients,9,FALSE)*E59+VLOOKUP(A60,Micronutrients,9,FALSE)*E60+VLOOKUP(A61,Micronutrients,9,FALSE)*E61+VLOOKUP(A62,Micronutrients,9,FALSE)*E62","v":0},{"$f":"VLOOKUP(A51,Macronutrients,10,FALSE)*E51+VLOOKUP(A52,Macronutrients,10,FALSE)*E52+VLOOKUP(A53,Macronutrients,10,FALSE)*E53+VLOOKUP(A54,Macronutrients,10,FALSE)*E54+VLOOKUP(A55,Macronutrients,10,FALSE)*E55+VLOOKUP(A56,Macronutrients,10,FALSE)*E56+VLOOKUP(A59,Micronutrients,10,FALSE)*E59+VLOOKUP(A60,Micronutrients,10,FALSE)*E60+VLOOKUP(A61,Micronutrients,10,FALSE)*E61+VLOOKUP(A62,Micronutrients,10,FALSE)*E62","v":0},null,null,null,null,null,null,null,null,null,{"$f":"VLOOKUP(M51,Macronutrients,8,FALSE)*Q51+VLOOKUP(M52,Macronutrients,8,FALSE)*Q52+VLOOKUP(M53,Macronutrients,8,FALSE)*Q53+VLOOKUP(M54,Macronutrients,8,FALSE)*Q54+VLOOKUP(M55,Macronutrients,8,FALSE)*Q55+VLOOKUP(M56,Macronutrients,8,FALSE)*Q56+VLOOKUP(M59,Micronutrients,8,FALSE)*Q59+VLOOKUP(M60,Micronutrients,8,FALSE)*Q60+VLOOKUP(M61,Micronutrients,8,FALSE)*Q61+VLOOKUP(M62,Micronutrients,8,FALSE)*Q62","v":0},{"$f":"VLOOKUP(M51,Macronutrients,9,FALSE)*Q51+VLOOKUP(M52,Macronutrients,9,FALSE)*Q52+VLOOKUP(M53,Macronutrients,9,FALSE)*Q53+VLOOKUP(M54,Macronutrients,9,FALSE)*Q54+VLOOKUP(M55,Macronutrients,9,FALSE)*Q55+VLOOKUP(M56,Macronutrients,9,FALSE)*Q56+VLOOKUP(M59,Micronutrients,9,FALSE)*Q59+VLOOKUP(M60,Micronutrients,9,FALSE)*Q60+VLOOKUP(M61,Micronutrients,9,FALSE)*Q61+VLOOKUP(M62,Micronutrients,9,FALSE)*Q62","v":0},{"$f":"VLOOKUP(M51,Macronutrients,10,FALSE)*Q51+VLOOKUP(M52,Macronutrients,10,FALSE)*Q52+VLOOKUP(M53,Macronutrients,10,FALSE)*Q53+VLOOKUP(M54,Macronutrients,10,FALSE)*Q54+VLOOKUP(M55,Macronutrients,10,FALSE)*Q55+VLOOKUP(M56,Macronutrients,10,FALSE)*Q56+VLOOKUP(M59,Micronutrients,10,FALSE)*Q59+VLOOKUP(M60,Micronutrients,10,FALSE)*Q60+VLOOKUP(M61,Micronutrients,10,FALSE)*Q61+VLOOKUP(M62,Micronutrients,10,FALSE)*Q62","v":0},null,null,null,null,null,null,null,null,null,{"$f":"VLOOKUP(Y51,Macronutrients,8,FALSE)*AC51+VLOOKUP(Y52,Macronutrients,8,FALSE)*AC52+VLOOKUP(Y53,Macronutrients,8,FALSE)*AC53+VLOOKUP(Y54,Macronutrients,8,FALSE)*AC54+VLOOKUP(Y55,Macronutrients,8,FALSE)*AC55+VLOOKUP(Y56,Macronutrients,8,FALSE)*AC56+VLOOKUP(Y59,Micronutrients,8,FALSE)*AC59+VLOOKUP(Y60,Micronutrients,8,FALSE)*AC60+VLOOKUP(Y61,Micronutrients,8,FALSE)*AC61+VLOOKUP(Y62,Micronutrients,8,FALSE)*AC62","v":0},{"$f":"VLOOKUP(Y51,Macronutrients,9,FALSE)*AC51+VLOOKUP(Y52,Macronutrients,9,FALSE)*AC52+VLOOKUP(Y53,Macronutrients,9,FALSE)*AC53+VLOOKUP(Y54,Macronutrients,9,FALSE)*AC54+VLOOKUP(Y55,Macronutrients,9,FALSE)*AC55+VLOOKUP(Y56,Macronutrients,9,FALSE)*AC56+VLOOKUP(Y59,Micronutrients,9,FALSE)*AC59+VLOOKUP(Y60,Micronutrients,9,FALSE)*AC60+VLOOKUP(Y61,Micronutrients,9,FALSE)*AC61+VLOOKUP(Y62,Micronutrients,9,FALSE)*AC62","v":0},{"$f":"VLOOKUP(Y51,Macronutrients,10,FALSE)*AC51+VLOOKUP(Y52,Macronutrients,10,FALSE)*AC52+VLOOKUP(Y53,Macronutrients,10,FALSE)*AC53+VLOOKUP(Y54,Macronutrients,10,FALSE)*AC54+VLOOKUP(Y55,Macronutrients,10,FALSE)*AC55+VLOOKUP(Y56,Macronutrients,10,FALSE)*AC56+VLOOKUP(Y59,Micronutrients,10,FALSE)*AC59+VLOOKUP(Y60,Micronutrients,10,FALSE)*AC60+VLOOKUP(Y61,Micronutrients,10,FALSE)*AC61+VLOOKUP(Y62,Micronutrients,10,FALSE)*AC62","v":0}]
["Micronutrients (drop down menu)",null,null,null,null,null,null,null,null,null,null,null,"Micronutrients (drop down menu)",null,null,null,null,null,null,null,null,null,null,null,"Micronutrients (drop down menu)"]
["None",{"$f":"VLOOKUP($A59,Micronutrients,14,FALSE)","v":0},{"$f":"VLOOKUP(A59,Micronutrients,18,FALSE)","v":0},{"$f":"VLOOKUP(A59,Micronutrients,16,FALSE)","v":1},0,{"$f":"VLOOKUP(A59,Micronutrients,15,FALSE)","v":0},{"$f":"(E59*VLOOKUP(A59,Micronutrients,14,FALSE)/D59)*C59","v":0},null,"Cu","Mo","Fe",null,"None",{"$f":"VLOOKUP($M59,Micronutrients,14,FALSE)","v":0},{"$f":"VLOOKUP(M59,Micronutrients,18,FALSE)","v":0},{"$f":"VLOOKUP(M59,Micronutrients,16,FALSE)","v":1},0,{"$f":"VLOOKUP(M59,Micronutrients,15,FALSE)","v":0},{"$f":"(Q59*VLOOKUP(M59,Micronutrients,14,FALSE)/P59)*O59","v":0},null,"Cu","Mo","Fe",null,"None",{"$f":"VLOOKUP(Y59,Micronutrients,14,FALSE)","v":0},{"$f":"VLOOKUP(Y59,Micronutrients,18,FALSE)","v":0},{"$f":"VLOOKUP(Y59,Micronutrients,16,FALSE)","v":1},0,{"$f":"VLOOKUP(Y59,Micronutrients,15,FALSE)","v":0},{"$f":"(AC59*VLOOKUP(Y59,Micronutrients,14,FALSE)/AB59)*AA59","v":0},null,"Cu","Mo","Fe"]
["None",{"$f":"VLOOKUP($A60,Micronutrients,14,FALSE)","v":0},{"$f":"VLOOKUP(A60,Micronutrients,18,FALSE)","v":0},{"$f":"VLOOKUP(A60,Micronutrients,16,FALSE)","v":1},0,{"$f":"VLOOKUP(A60,Micronutrients,15,FALSE)","v":0},{"$f":"(E60*VLOOKUP(A60,Micronutrients,14,FALSE)/D60)*C60","v":0},null,{"$f":"VLOOKUP(A51,Macronutrients,11,FALSE)*E51+VLOOKUP(A52,Macronutrients,11,FALSE)*E52+VLOOKUP(A53,Macronutrients,11,FALSE)*E53+VLOOKUP(A54,Macronutrients,11,FALSE)*E54+VLOOKUP(A55,Macronutrients,11,FALSE)*E55+VLOOKUP(A56,Macronutrients,11,FALSE)*E56+VLOOKUP(A59,Micronutrients,11,FALSE)*E59+VLOOKUP(A60,Micronutrients,11,FALSE)*E60+VLOOKUP(A61,Micronutrients,11,FALSE)*E61+VLOOKUP(A62,Micronutrients,11,FALSE)*E62","v":0},{"$f":"VLOOKUP(A51,Macronutrients,12,FALSE)*E51+VLOOKUP(A52,Macronutrients,12,FALSE)*E52+VLOOKUP(A53,Macronutrients,12,FALSE)*E53+VLOOKUP(A54,Macronutrients,12,FALSE)*E54+VLOOKUP(A55,Macronutrients,12,FALSE)*E55+VLOOKUP(A56,Macronutrients,12,FALSE)*E56+VLOOKUP(A59,Micronutrients,12,FALSE)*E59+VLOOKUP(A60,Micronutrients,12,FALSE)*E60+VLOOKUP(A61,Micronutrients,12,FALSE)*E61+VLOOKUP(A62,Micronutrients,12,FALSE)*E62","v":0},{"$f":"VLOOKUP(A51,Macronutrients,13,FALSE)*E51+VLOOKUP(A52,Macronutrients,13,FALSE)*E52+VLOOKUP(A53,Macronutrients,13,FALSE)*E53+VLOOKUP(A54,Macronutrients,13,FALSE)*E54+VLOOKUP(A55,Macronutrients,13,FALSE)*E55+VLOOKUP(A56,Macronutrients,13,FALSE)*E56+VLOOKUP(A59,Micronutrients,13,FALSE)*E59+VLOOKUP(A60,Micronutrients,13,FALSE)*E60+VLOOKUP(A61,Micronutrients,13,FALSE)*E61+VLOOKUP(A62,Micronutrients,13,FALSE)*E62","v":0},null,"None",{"$f":"VLOOKUP($M60,Micronutrients,14,FALSE)","v":0},{"$f":"VLOOKUP(M60,Micronutrients,18,FALSE)","v":0},{"$f":"VLOOKUP(M60,Micronutrients,16,FALSE)","v":1},0,{"$f":"VLOOKUP(M60,Micronutrients,15,FALSE)","v":0},{"$f":"(Q60*VLOOKUP(M60,Micronutrients,14,FALSE)/P60)*O60","v":0},null,{"$f":"VLOOKUP(M51,Macronutrients,11,FALSE)*Q51+VLOOKUP(M52,Macronutrients,11,FALSE)*Q52+VLOOKUP(M53,Macronutrients,11,FALSE)*Q53+VLOOKUP(M54,Macronutrients,11,FALSE)*Q54+VLOOKUP(M55,Macronutrients,11,FALSE)*Q55+VLOOKUP(M56,Macronutrients,11,FALSE)*Q56+VLOOKUP(M59,Micronutrients,11,FALSE)*Q59+VLOOKUP(M60,Micronutrients,11,FALSE)*Q60+VLOOKUP(M61,Micronutrients,11,FALSE)*Q61+VLOOKUP(M62,Micronutrients,11,FALSE)*Q62","v":0},{"$f":"VLOOKUP(M51,Macronutrients,12,FALSE)*Q51+VLOOKUP(M52,Macronutrients,12,FALSE)*Q52+VLOOKUP(M53,Macronutrients,12,FALSE)*Q53+VLOOKUP(M54,Macronutrients,12,FALSE)*Q54+VLOOKUP(M55,Macronutrients,12,FALSE)*Q55+VLOOKUP(M56,Macronutrients,12,FALSE)*Q56+VLOOKUP(M59,Micronutrients,12,FALSE)*Q59+VLOOKUP(M60,Micronutrients,12,FALSE)*Q60+VLOOKUP(M61,Micronutrients,12,FALSE)*Q61+VLOOKUP(M62,Micronutrients,12,FALSE)*Q62","v":0},{"$f":"VLOOKUP(M51,Macronutrients,13,FALSE)*Q51+VLOOKUP(M52,Macronutrients,13,FALSE)*Q52+VLOOKUP(M53,Macronutrients,13,FALSE)*Q53+VLOOKUP(M54,Macronutrients,13,FALSE)*Q54+VLOOKUP(M55,Macronutrients,13,FALSE)*Q55+VLOOKUP(M56,Macronutrients,13,FALSE)*Q56+VLOOKUP(M59,Micronutrients,13,FALSE)*Q59+VLOOKUP(M60,Micronutrients,13,FALSE)*Q60+VLOOKUP(M61,Micronutrients,13,FALSE)*Q61+VLOOKUP(M62,Micronutrients,13,FALSE)*Q62","v":0},null,"None",{"$f":"VLOOKUP(Y60,Micronutrients,14,FALSE)","v":0},{"$f":"VLOOKUP(Y60,Micronutrients,18,FALSE)","v":0},{"$f":"VLOOKUP(Y60,Micronutrients,16,FALSE)","v":1},0,{"$f":"VLOOKUP(Y60,Micronutrients,15,FALSE)","v":0},{"$f":"(AC60*VLOOKUP(Y60,Micronutrients,14,FALSE)/AB60)*AA60","v":0},null,{"$f":"VLOOKUP(Y51,Macronutrients,11,FALSE)*AC51+VLOOKUP(Y52,Macronutrients,11,FALSE)*AC52+VLOOKUP(Y53,Macronutrients,11,FALSE)*AC53+VLOOKUP(Y54,Macronutrients,11,FALSE)*AC54+VLOOKUP(Y55,Macronutrients,11,FALSE)*AC55+VLOOKUP(Y56,Macronutrients,11,FALSE)*AC56+VLOOKUP(Y59,Micronutrients,11,FALSE)*AC59+VLOOKUP(Y60,Micronutrients,11,FALSE)*AC60+VLOOKUP(Y61,Micronutrients,11,FALSE)*AC61+VLOOKUP(Y62,Micronutrients,11,FALSE)*AC62","v":0},{"$f":"VLOOKUP(Y51,Macronutrients,12,FALSE)*AC51+VLOOKUP(Y52,Macronutrients,12,FALSE)*AC52+VLOOKUP(Y53,Macronutrients,12,FALSE)*AC53+VLOOKUP(Y54,Macronutrients,12,FALSE)*AC54+VLOOKUP(Y55,Macronutrients,12,FALSE)*AC55+VLOOKUP(Y56,Macronutrients,12,FALSE)*AC56+VLOOKUP(Y59,Micronutrients,12,FALSE)*AC59+VLOOKUP(Y60,Micronutrients,12,FALSE)*AC60+VLOOKUP(Y61,Micronutrients,12,FALSE)*AC61+VLOOKUP(Y62,Micronutrients,12,FALSE)*AC62","v":0},{"$f":"VLOOKUP(Y51,Macronutrients,13,FALSE)*AC51+VLOOKUP(Y52,Macronutrients,13,FALSE)*AC52+VLOOKUP(Y53,Macronutrients,13,FALSE)*AC53+VLOOKUP(Y54,Macronutrients,13,FALSE)*AC54+VLOOKUP(Y55,Macronutrients,13,FALSE)*AC55+VLOOKUP(Y56,Macronutrients,13,FALSE)*AC56+VLOOKUP(Y59,Micronutrients,13,FALSE)*AC59+VLOOKUP(Y60,Micronutrients,13,FALSE)*AC60+VLOOKUP(Y61,Micronutrients,13,FALSE)*AC61+VLOOKUP(Y62,Micronutrients,13,FALSE)*AC62","v":0}]
["None",{"$f":"VLOOKUP($A61,Micronutrients,14,FALSE)","v":0},{"$f":"VLOOKUP(A61,Micronutrients,18,FALSE)","v":0},{"$f":"VLOOKUP(A61,Micronutrients,16,FALSE)","v":1},0,{"$f":"VLOOKUP(A61,Micronutrients,15,FALSE)","v":0},{"$f":"(E61*VLOOKUP(A61,Micronutrients,14,FALSE)/D61)*C61","v":0},null,null,null,null,null,"None",{"$f":"VLOOKUP($M61,Micronutrients,14,FALSE)","v":0},{"$f":"VLOOKUP(M61,Micronutrients,18,FALSE)","v":0},{"$f":"VLOOKUP(M61,Micronutrients,16,FALSE)","v":1},0,{"$f":"VLOOKUP(M61,Micronutrients,15,FALSE)","v":0},{"$f":"(Q61*VLOOKUP(M61,Micronutrients,14,FALSE)/P61)*O61","v":0},null,null,null,null,null,"None",{"$f":"VLOOKUP(Y61,Micronutrients,14,FALSE)","v":0},{"$f":"VLOOKUP(Y61,Micronutrients,18,FALSE)","v":0},{"$f":"VLOOKUP(Y61,Micronutrients,16,FALSE)","v":1},0,{"$f":"VLOOKUP(Y61,Micronutrients,15,FALSE)","v":0},{"$f":"(AC61*VLOOKUP(Y61,Micronutrients,14,FALSE)/AB61)*AA61","v":0}]
["None",{"$f":"VLOOKUP($A62,Micronutrients,14,FALSE)","v":0},{"$f":"VLOOKUP(A62,Micronutrients,18,FALSE)","v":0},{"$f":"VLOOKUP(A62,Micronutrients,16,FALSE)","v":1},0,{"$f":"VLOOKUP(A62,Micronutrients,15,FALSE)","v":0},{"$f":"(E62*VLOOKUP(A62,Micronutrients,14,FALSE)/D62)*C62","v":0},null,null,null,null,null,"None",{"$f":"VLOOKUP($M62,Micronutrients,14,FALSE)","v":0},{"$f":"VLOOKUP(M62,Micronutrients,18,FALSE)","v":0},{"$f":"VLOOKUP(M62,Micronutrients,16,FALSE)","v":1},0,{"$f":"VLOOKUP(M62,Micronutrients,15,FALSE)","v":0},{"$f":"(Q62*VLOOKUP(M62,Micronutrients,14,FALSE)/P62)*O62","v":0},null,null,null,null,null,"None",{"$f":"VLOOKUP(Y62,Micronutrients,14,FALSE)","v":0},{"$f":"VLOOKUP(Y62,Micronutrients,18,FALSE)","v":0},{"$f":"VLOOKUP(Y62,Micronutrients,16,FALSE)","v":1},0,{"$f":"VLOOKUP(Y62,Micronutrients,15,FALSE)","v":0},{"$f":"(AC62*VLOOKUP(Y62,Micronutrients,14,FALSE)/AB62)*AA62","v":0}]
[]
["Nitrogen Stabilizers (drop down menu)",null,null,null,null,null,null,null,null,null,null,null,"Nitrogen Stabilizers (drop down menu)",null,null,null,null,null,null,null,null,null,null,null,"Nitrogen Stabilizers (drop down menu)"]
["None",{"$f":"VLOOKUP(A65,NitrogenStabilizers,14,FALSE)","v":0},{"$f":"VLOOKUP(A65,NitrogenStabilizers,18,FALSE)","v":0},{"$f":"VLOOKUP(A65,NitrogenStabilizers,16,FALSE)","v":1},0,{"$f":"VLOOKUP(A65,NitrogenStabilizers,15,FALSE)","v":0},{"$f":"(E65*VLOOKUP(A65,NitrogenStabilizers,14,FALSE)/D65)*C65","v":0},null,null,null,null,null,"None",{"$f":"VLOOKUP(M65,NitrogenStabilizers,14,FALSE)","v":0},{"$f":"VLOOKUP(M65,NitrogenStabilizers,18,FALSE)","v":0},{"$f":"VLOOKUP(M65,NitrogenStabilizers,16,FALSE)","v":1},0,{"$f":"VLOOKUP(M65,NitrogenStabilizers,15,FALSE)","v":0},{"$f":"(Q65*VLOOKUP(M65,NitrogenStabilizers,14,FALSE)/P65)*O65","v":0},null,null,null,null,null,"None",{"$f":"VLOOKUP(Y65,NitrogenStabilizers,14,FALSE)","v":0},{"$f":"VLOOKUP(Y65,NitrogenStabilizers,18,FALSE)","v":0},{"$f":"VLOOKUP(Y65,NitrogenStabilizers,16,FALSE)","v":1},0,{"$f":"VLOOKUP(Y65,NitrogenStabilizers,15,FALSE)","v":0},{"$f":"(AC65*VLOOKUP(Y65,NitrogenStabilizers,14,FALSE)/AB65)*AA65","v":0}]
["None",{"$f":"VLOOKUP(A66,NitrogenStabilizers,14,FALSE)","v":0},{"$f":"VLOOKUP(A66,NitrogenStabilizers,18,FALSE)","v":0},{"$f":"VLOOKUP(A66,NitrogenStabilizers,16,FALSE)","v":1},0,{"$f":"VLOOKUP(A66,NitrogenStabilizers,15,FALSE)","v":0},{"$f":"(E66*VLOOKUP(A66,NitrogenStabilizers,14,FALSE)/D66)*C66","v":0},null,null,null,"More",null,"None",{"$f":"VLOOKUP(M66,NitrogenStabilizers,14,FALSE)","v":0},{"$f":"VLOOKUP(M66,NitrogenStabilizers,18,FALSE)","v":0},{"$f":"VLOOKUP(M66,NitrogenStabilizers,16,FALSE)","v":1},0,{"$f":"VLOOKUP(M66,NitrogenStabilizers,15,FALSE)","v":0},{"$f":"(Q66*VLOOKUP(M66,NitrogenStabilizers,14,FALSE)/P66)*O66","v":0},null,null,null,"More",null,"None",{"$f":"VLOOKUP(Y66,NitrogenStabilizers,14,FALSE)","v":0},{"$f":"VLOOKUP(Y66,NitrogenStabilizers,18,FALSE)","v":0},{"$f":"VLOOKUP(Y66,NitrogenStabilizers,16,FALSE)","v":1},0,{"$f":"VLOOKUP(Y66,NitrogenStabilizers,15,FALSE)","v":0},{"$f":"(AC66*VLOOKUP(Y66,NitrogenStabilizers,14,FALSE)/AB66)*AA66","v":0},null,null,null,"More"]
["3rd Application Fertilizer Cost/Acre",null,null,null,null,null,{"$f":"SUM(G51:G66)","v":0},null,null,null,"Below",null,"3rd Application Fertilizer Cost/Acre",null,null,null,null,null,{"$f":"SUM(S51:S66)","v":0},null,null,null,"Below",null,"3rd Application Fertilizer Cost/Acre",null,null,null,null,null,{"$f":"SUM(AE51:AE66)","v":0},null,null,null,"Below"]
[null,null,null,null,null,null,null,null,null,null,"¯",null,null,null,null,null,null,null,null,null,null,null,"¯",null,null,null,null,null,null,null,null,null,null,null,"¯"]
["4th Application (i.e., Side-Dress or Broadcast or Fertigation)",null,null,null,null,null,null,null,null,null,null,null,"4th Application (i.e., Side-Dress or Broadcast or Fertigation)",null,null,null,null,null,null,null,null,null,null,null,"4th Application (i.e., Side-Dress or Broadcast or Fertigation)"]
["Fertilizer Source","Purchase Units","Package Price (Gals, Lbs, etc.)","Units/Pkg","Rate/Acre","Units","Cost",null,null,null,null,null,"Fertilizer Source","Purchase Units","Package Price (Gals, Lbs, etc.)","Units/Pkg","Rate/Acre","Units","Cost",null,null,null,null,null,"Fertilizer Source","Purchase Units","Package Price (Gals, Lbs, etc.)","Units/Pkg","Rate/Acre","Units","Cost"]
["Macronutrients (drop down menu)",null,null,null,"(Enter Below)",null,null,null,"N","P","K",null,"Macronutrients (drop down menu)",null,null,null,"(Enter Below)",null,null,null,"N","P","K",null,"Macronutrients (drop down menu)",null,null,null,"(Enter Below)",null,null,null,"N","P","K"]
["None",{"$f":"VLOOKUP(A72,Macronutrients,14,FALSE)","v":0},{"$f":"VLOOKUP(A72,Macronutrients,18,FALSE)","v":0},{"$f":"VLOOKUP(A72,Macronutrients,16,FALSE)","v":1},0,{"$f":"VLOOKUP(A72,Macronutrients,15,FALSE)","v":0},{"$f":"(E72*VLOOKUP(A72,Macronutrients,14,FALSE)/D72)*C72","v":0},null,{"$f":"VLOOKUP(A72,Macronutrients,2,FALSE)*E72+VLOOKUP(A73,Macronutrients,2,FALSE)*E73+VLOOKUP(A74,Macronutrients,2,FALSE)*E74+VLOOKUP(A75,Macronutrients,2,FALSE)*E75+VLOOKUP(A76,Macronutrients,2,FALSE)*E76+VLOOKUP(A77,Macronutrients,2,FALSE)*E77+VLOOKUP(A80,Micronutrients,2,FALSE)*E80+VLOOKUP(A81,Micronutrients,2,FALSE)*E81+VLOOKUP(A82,Micronutrients,2,FALSE)*E82+VLOOKUP(A83,Micronutrients,2,FALSE)*E83","v":0},{"$f":"VLOOKUP(A72,Macronutrients,3,FALSE)*E72+VLOOKUP(A73,Macronutrients,3,FALSE)*E73+VLOOKUP(A74,Macronutrients,3,FALSE)*E74+VLOOKUP(A75,Macronutrients,3,FALSE)*E75+VLOOKUP(A76,Macronutrients,3,FALSE)*E76+VLOOKUP(A77,Macronutrients,3,FALSE)*E77+VLOOKUP(A80,Micronutrients,3,FALSE)*E80+VLOOKUP(A81,Micronutrients,3,FALSE)*E81+VLOOKUP(A82,Micronutrients,3,FALSE)*E82+VLOOKUP(A83,Micronutrients,3,FALSE)*E83","v":0},{"$f":"VLOOKUP(A72,Macronutrients,4,FALSE)*E72+VLOOKUP(A73,Macronutrients,4,FALSE)*E73+VLOOKUP(A74,Macronutrients,4,FALSE)*E74+VLOOKUP(A75,Macronutrients,4,FALSE)*E75+VLOOKUP(A76,Macronutrients,4,FALSE)*E76+VLOOKUP(A77,Macronutrients,4,FALSE)*E77+VLOOKUP(A80,Micronutrients,4,FALSE)*E80+VLOOKUP(A81,Micronutrients,4,FALSE)*E81+VLOOKUP(A82,Micronutrients,4,FALSE)*E82+VLOOKUP(A83,Micronutrients,4,FALSE)*E83","v":0},null,"None",{"$f":"VLOOKUP(M72,Macronutrients,14,FALSE)","v":0},{"$f":"VLOOKUP(M72,Macronutrients,18,FALSE)","v":0},{"$f":"VLOOKUP(M72,Macronutrients,16,FALSE)","v":1},0,{"$f":"VLOOKUP(M72,Macronutrients,15,FALSE)","v":0},{"$f":"(Q72*VLOOKUP(M72,Macronutrients,14,FALSE)/P72)*O72","v":0},null,{"$f":"VLOOKUP(M72,Macronutrients,2,FALSE)*Q72+VLOOKUP(M73,Macronutrients,2,FALSE)*Q73+VLOOKUP(M74,Macronutrients,2,FALSE)*Q74+VLOOKUP(M75,Macronutrients,2,FALSE)*Q75+VLOOKUP(M76,Macronutrients,2,FALSE)*Q76+VLOOKUP(M77,Macronutrients,2,FALSE)*Q77+VLOOKUP(M80,Micronutrients,2,FALSE)*Q80+VLOOKUP(M81,Micronutrients,2,FALSE)*Q81+VLOOKUP(M82,Micronutrients,2,FALSE)*Q82+VLOOKUP(M83,Micronutrients,2,FALSE)*Q83","v":0},{"$f":"VLOOKUP(M72,Macronutrients,3,FALSE)*Q72+VLOOKUP(M73,Macronutrients,3,FALSE)*Q73+VLOOKUP(M74,Macronutrients,3,FALSE)*Q74+VLOOKUP(M75,Macronutrients,3,FALSE)*Q75+VLOOKUP(M76,Macronutrients,3,FALSE)*Q76+VLOOKUP(M77,Macronutrients,3,FALSE)*Q77+VLOOKUP(M80,Micronutrients,3,FALSE)*Q80+VLOOKUP(M81,Micronutrients,3,FALSE)*Q81+VLOOKUP(M82,Micronutrients,3,FALSE)*Q82+VLOOKUP(M83,Micronutrients,3,FALSE)*Q83","v":0},{"$f":"VLOOKUP(M72,Macronutrients,4,FALSE)*Q72+VLOOKUP(M73,Macronutrients,4,FALSE)*Q73+VLOOKUP(M74,Macronutrients,4,FALSE)*Q74+VLOOKUP(M75,Macronutrients,4,FALSE)*Q75+VLOOKUP(M76,Macronutrients,4,FALSE)*Q76+VLOOKUP(M77,Macronutrients,4,FALSE)*Q77+VLOOKUP(M80,Micronutrients,4,FALSE)*Q80+VLOOKUP(M81,Micronutrients,4,FALSE)*Q81+VLOOKUP(M82,Micronutrients,4,FALSE)*Q82+VLOOKUP(M83,Micronutrients,4,FALSE)*Q83","v":0},null,"None",{"$f":"VLOOKUP(Y72,Macronutrients,14,FALSE)","v":0},{"$f":"VLOOKUP(Y72,Macronutrients,18,FALSE)","v":0},{"$f":"VLOOKUP(Y72,Macronutrients,16,FALSE)","v":1},0,{"$f":"VLOOKUP(Y72,Macronutrients,15,FALSE)","v":0},{"$f":"(AC72*VLOOKUP(Y72,Macronutrients,14,FALSE)/AB72)*AA72","v":0},null,{"$f":"VLOOKUP(Y72,Macronutrients,2,FALSE)*AC72+VLOOKUP(Y73,Macronutrients,2,FALSE)*AC73+VLOOKUP(Y74,Macronutrients,2,FALSE)*AC74+VLOOKUP(Y75,Macronutrients,2,FALSE)*AC75+VLOOKUP(Y76,Macronutrients,2,FALSE)*AC76+VLOOKUP(Y77,Macronutrients,2,FALSE)*AC77+VLOOKUP(Y80,Micronutrients,2,FALSE)*AC80+VLOOKUP(Y81,Micronutrients,2,FALSE)*AC81+VLOOKUP(Y82,Micronutrients,2,FALSE)*AC82+VLOOKUP(Y83,Micronutrients,2,FALSE)*AC83","v":0},{"$f":"VLOOKUP(Y72,Macronutrients,3,FALSE)*AC72+VLOOKUP(Y73,Macronutrients,3,FALSE)*AC73+VLOOKUP(Y74,Macronutrients,3,FALSE)*AC74+VLOOKUP(Y75,Macronutrients,3,FALSE)*AC75+VLOOKUP(Y76,Macronutrients,3,FALSE)*AC76+VLOOKUP(Y77,Macronutrients,3,FALSE)*AC77+VLOOKUP(Y80,Micronutrients,3,FALSE)*AC80+VLOOKUP(Y81,Micronutrients,3,FALSE)*AC81+VLOOKUP(Y82,Micronutrients,3,FALSE)*AC82+VLOOKUP(Y83,Micronutrients,3,FALSE)*AC83","v":0},{"$f":"VLOOKUP(Y72,Macronutrients,4,FALSE)*AC72+VLOOKUP(Y73,Macronutrients,4,FALSE)*AC73+VLOOKUP(Y74,Macronutrients,4,FALSE)*AC74+VLOOKUP(Y75,Macronutrients,4,FALSE)*AC75+VLOOKUP(Y76,Macronutrients,4,FALSE)*AC76+VLOOKUP(Y77,Macronutrients,4,FALSE)*AC77+VLOOKUP(Y80,Micronutrients,4,FALSE)*AC80+VLOOKUP(Y81,Micronutrients,4,FALSE)*AC81+VLOOKUP(Y82,Micronutrients,4,FALSE)*AC82+VLOOKUP(Y83,Micronutrients,4,FALSE)*AC83","v":0}]
["None",0,0,1,0,0,0,null,null,null,null,null,"None",{"$f":"VLOOKUP(M73,Macronutrients,14,FALSE)","v":0},0,1,0,0,0,null,null,null,null,null,"None",0,0,1,0,0,0]
["None",0,0,1,0,0,0,null,"S","Ca","Mg",null,"None",0,0,1,0,0,0,null,"S","Ca","Mg",null,"None",0,0,1,0,0,0,null,"S","Ca","Mg"]
["None",0,0,1,0,0,0,null,{"$f":"VLOOKUP(A72,Macronutrients,5,FALSE)*E72+VLOOKUP(A73,Macronutrients,5,FALSE)*E73+VLOOKUP(A74,Macronutrients,5,FALSE)*E74+VLOOKUP(A75,Macronutrients,5,FALSE)*E75+VLOOKUP(A76,Macronutrients,5,FALSE)*E76+VLOOKUP(A77,Macronutrients,5,FALSE)*E77+VLOOKUP(A80,Micronutrients,5,FALSE)*E80+VLOOKUP(A81,Micronutrients,5,FALSE)*E81+VLOOKUP(A82,Micronutrients,5,FALSE)*E82+VLOOKUP(A83,Micronutrients,5,FALSE)*E83","v":0},{"$f":"VLOOKUP(A72,Macronutrients,7,FALSE)*E72+VLOOKUP(A73,Macronutrients,7,FALSE)*E73+VLOOKUP(A74,Macronutrients,7,FALSE)*E74+VLOOKUP(A75,Macronutrients,7,FALSE)*E75+VLOOKUP(A76,Macronutrients,7,FALSE)*E76+VLOOKUP(A77,Macronutrients,7,FALSE)*E77+VLOOKUP(A80,Micronutrients,7,FALSE)*E80+VLOOKUP(A81,Micronutrients,7,FALSE)*E81+VLOOKUP(A82,Micronutrients,7,FALSE)*E82+VLOOKUP(A83,Micronutrients,7,FALSE)*E83","v":0},{"$f":"VLOOKUP($A72,Macronutrients,6,FALSE)*$E$6+VLOOKUP($A73,Macronutrients,6,FALSE)*$E$7+VLOOKUP($A74,Macronutrients,6,FALSE)*$E$8+VLOOKUP($A75,Macronutrients,6,FALSE)*$E$9+VLOOKUP($A76,Macronutrients,6,FALSE)*$E$10+VLOOKUP($A77,Macronutrients,6,FALSE)*$E$11+VLOOKUP($A80,Micronutrients,6,FALSE)*$E$14+VLOOKUP($A81,Micronutrients,6,FALSE)*E81+VLOOKUP($A82,Micronutrients,6,FALSE)*$E$16+VLOOKUP($A83,Micronutrients,6,FALSE)*$E$17","v":0},null,"None",0,0,1,0,0,0,null,{"$f":"VLOOKUP(M72,Macronutrients,5,FALSE)*Q72+VLOOKUP(M73,Macronutrients,5,FALSE)*Q73+VLOOKUP(M74,Macronutrients,5,FALSE)*Q74+VLOOKUP(M75,Macronutrients,5,FALSE)*Q75+VLOOKUP(M76,Macronutrients,5,FALSE)*Q76+VLOOKUP(M77,Macronutrients,5,FALSE)*Q77+VLOOKUP(M80,Micronutrients,5,FALSE)*Q80+VLOOKUP(M81,Micronutrients,5,FALSE)*Q81+VLOOKUP(M82,Micronutrients,5,FALSE)*Q82+VLOOKUP(M83,Micronutrients,5,FALSE)*Q83","v":0},{"$f":"VLOOKUP(M72,Macronutrients,7,FALSE)*Q72+VLOOKUP(M73,Macronutrients,7,FALSE)*Q73+VLOOKUP(M74,Macronutrients,7,FALSE)*Q74+VLOOKUP(M75,Macronutrients,7,FALSE)*Q75+VLOOKUP(M76,Macronutrients,7,FALSE)*Q76+VLOOKUP(M77,Macronutrients,7,FALSE)*Q77+VLOOKUP(M80,Micronutrients,7,FALSE)*Q80+VLOOKUP(M81,Micronutrients,7,FALSE)*Q81+VLOOKUP(M82,Micronutrients,7,FALSE)*Q82+VLOOKUP(M83,Micronutrients,7,FALSE)*Q83","v":0},{"$f":"VLOOKUP($A72,Macronutrients,6,FALSE)*$E$6+VLOOKUP($A73,Macronutrients,6,FALSE)*$E$7+VLOOKUP($A74,Macronutrients,6,FALSE)*$E$8+VLOOKUP($A75,Macronutrients,6,FALSE)*$E$9+VLOOKUP($A76,Macronutrients,6,FALSE)*$E$10+VLOOKUP($A77,Macronutrients,6,FALSE)*$E$11+VLOOKUP($A80,Micronutrients,6,FALSE)*$E$14+VLOOKUP($A81,Micronutrients,6,FALSE)*Q81+VLOOKUP($A82,Micronutrients,6,FALSE)*$E$16+VLOOKUP($A83,Micronutrients,6,FALSE)*$E$17","v":0},null,"None",0,0,1,0,0,0,null,{"$f":"VLOOKUP(Y72,Macronutrients,5,FALSE)*AC72+VLOOKUP(Y73,Macronutrients,5,FALSE)*AC73+VLOOKUP(Y74,Macronutrients,5,FALSE)*AC74+VLOOKUP(Y75,Macronutrients,5,FALSE)*AC75+VLOOKUP(Y76,Macronutrients,5,FALSE)*AC76+VLOOKUP(Y77,Macronutrients,5,FALSE)*AC77+VLOOKUP(Y80,Micronutrients,5,FALSE)*AC80+VLOOKUP(Y81,Micronutrients,5,FALSE)*AC81+VLOOKUP(Y82,Micronutrients,5,FALSE)*AC82+VLOOKUP(Y83,Micronutrients,5,FALSE)*AC83","v":0},{"$f":"VLOOKUP(Y72,Macronutrients,7,FALSE)*AC72+VLOOKUP(Y73,Macronutrients,7,FALSE)*AC73+VLOOKUP(Y74,Macronutrients,7,FALSE)*AC74+VLOOKUP(Y75,Macronutrients,7,FALSE)*AC75+VLOOKUP(Y76,Macronutrients,7,FALSE)*AC76+VLOOKUP(Y77,Macronutrients,7,FALSE)*AC77+VLOOKUP(Y80,Micronutrients,7,FALSE)*AC80+VLOOKUP(Y81,Micronutrients,7,FALSE)*AC81+VLOOKUP(Y82,Micronutrients,7,FALSE)*AC82+VLOOKUP(Y83,Micronutrients,7,FALSE)*AC83","v":0},{"$f":"VLOOKUP($A72,Macronutrients,6,FALSE)*$E$6+VLOOKUP($A73,Macronutrients,6,FALSE)*$E$7+VLOOKUP($A74,Macronutrients,6,FALSE)*$E$8+VLOOKUP($A75,Macronutrients,6,FALSE)*$E$9+VLOOKUP($A76,Macronutrients,6,FALSE)*$E$10+VLOOKUP($A77,Macronutrients,6,FALSE)*$E$11+VLOOKUP($A80,Micronutrients,6,FALSE)*$E$14+VLOOKUP($A81,Micronutrients,6,FALSE)*AC81+VLOOKUP($A82,Micronutrients,6,FALSE)*$E$16+VLOOKUP($A83,Micronutrients,6,FALSE)*$E$17","v":0}]
["None",0,0,1,0,0,0,null,null,null,null,null,"None",0,0,1,0,0,0,null,null,null,null,null,"None",0,0,1,0,0,0]
["None",0,0,1,0,0,0,null,"Z","B","Mn",null,"None",0,0,1,0,0,0,null,"Z","B","Mn",null,"None",0,0,1,0,0,0,null,"Z","B","Mn"]
[null,null,null,null,null,null,null,null,{"$f":"VLOOKUP(A72,Macronutrients,8,FALSE)*E72+VLOOKUP(A73,Macronutrients,8,FALSE)*E73+VLOOKUP(A74,Macronutrients,8,FALSE)*E74+VLOOKUP(A75,Macronutrients,8,FALSE)*E75+VLOOKUP(A76,Macronutrients,8,FALSE)*E76+VLOOKUP(A77,Macronutrients,8,FALSE)*E77+VLOOKUP(A80,Micronutrients,8,FALSE)*E80+VLOOKUP(A81,Micronutrients,8,FALSE)*E81+VLOOKUP(A82,Micronutrients,8,FALSE)*E82+VLOOKUP(A83,Micronutrients,8,FALSE)*E83","v":0},{"$f":"VLOOKUP(A72,Macronutrients,9,FALSE)*E72+VLOOKUP(A73,Macronutrients,9,FALSE)*E73+VLOOKUP(A74,Macronutrients,9,FALSE)*E74+VLOOKUP(A75,Macronutrients,9,FALSE)*E75+VLOOKUP(A76,Macronutrients,9,FALSE)*E76+VLOOKUP(A77,Macronutrients,9,FALSE)*E77+VLOOKUP(A80,Micronutrients,9,FALSE)*E80+VLOOKUP(A81,Micronutrients,9,FALSE)*E81+VLOOKUP(A82,Micronutrients,9,FALSE)*E82+VLOOKUP(A83,Micronutrients,9,FALSE)*E83","v":0},{"$f":"VLOOKUP(A72,Macronutrients,10,FALSE)*E72+VLOOKUP(A73,Macronutrients,10,FALSE)*E73+VLOOKUP(A74,Macronutrients,10,FALSE)*E74+VLOOKUP(A75,Macronutrients,10,FALSE)*E75+VLOOKUP(A76,Macronutrients,10,FALSE)*E76+VLOOKUP(A77,Macronutrients,10,FALSE)*E77+VLOOKUP(A80,Micronutrients,10,FALSE)*E80+VLOOKUP(A81,Micronutrients,10,FALSE)*E81+VLOOKUP(A82,Micronutrients,10,FALSE)*E82+VLOOKUP(A83,Micronutrients,10,FALSE)*E83","v":0},null,null,null,null,null,null,null,null,null,{"$f":"VLOOKUP(M72,Macronutrients,8,FALSE)*Q72+VLOOKUP(M73,Macronutrients,8,FALSE)*Q73+VLOOKUP(M74,Macronutrients,8,FALSE)*Q74+VLOOKUP(M75,Macronutrients,8,FALSE)*Q75+VLOOKUP(M76,Macronutrients,8,FALSE)*Q76+VLOOKUP(M77,Macronutrients,8,FALSE)*Q77+VLOOKUP(M80,Micronutrients,8,FALSE)*Q80+VLOOKUP(M81,Micronutrients,8,FALSE)*Q81+VLOOKUP(M82,Micronutrients,8,FALSE)*Q82+VLOOKUP(M83,Micronutrients,8,FALSE)*Q83","v":0},{"$f":"VLOOKUP(M72,Macronutrients,9,FALSE)*Q72+VLOOKUP(M73,Macronutrients,9,FALSE)*Q73+VLOOKUP(M74,Macronutrients,9,FALSE)*Q74+VLOOKUP(M75,Macronutrients,9,FALSE)*Q75+VLOOKUP(M76,Macronutrients,9,FALSE)*Q76+VLOOKUP(M77,Macronutrients,9,FALSE)*Q77+VLOOKUP(M80,Micronutrients,9,FALSE)*Q80+VLOOKUP(M81,Micronutrients,9,FALSE)*Q81+VLOOKUP(M82,Micronutrients,9,FALSE)*Q82+VLOOKUP(M83,Micronutrients,9,FALSE)*Q83","v":0},{"$f":"VLOOKUP(M72,Macronutrients,10,FALSE)*Q72+VLOOKUP(M73,Macronutrients,10,FALSE)*Q73+VLOOKUP(M74,Macronutrients,10,FALSE)*Q74+VLOOKUP(M75,Macronutrients,10,FALSE)*Q75+VLOOKUP(M76,Macronutrients,10,FALSE)*Q76+VLOOKUP(M77,Macronutrients,10,FALSE)*Q77+VLOOKUP(M80,Micronutrients,10,FALSE)*Q80+VLOOKUP(M81,Micronutrients,10,FALSE)*Q81+VLOOKUP(M82,Micronutrients,10,FALSE)*Q82+VLOOKUP(M83,Micronutrients,10,FALSE)*Q83","v":0},null,null,null,null,null,null,null,null,null,{"$f":"VLOOKUP(Y72,Macronutrients,8,FALSE)*AC72+VLOOKUP(Y73,Macronutrients,8,FALSE)*AC73+VLOOKUP(Y74,Macronutrients,8,FALSE)*AC74+VLOOKUP(Y75,Macronutrients,8,FALSE)*AC75+VLOOKUP(Y76,Macronutrients,8,FALSE)*AC76+VLOOKUP(Y77,Macronutrients,8,FALSE)*AC77+VLOOKUP(Y80,Micronutrients,8,FALSE)*AC80+VLOOKUP(Y81,Micronutrients,8,FALSE)*AC81+VLOOKUP(Y82,Micronutrients,8,FALSE)*AC82+VLOOKUP(Y83,Micronutrients,8,FALSE)*AC83","v":0},{"$f":"VLOOKUP(Y72,Macronutrients,9,FALSE)*AC72+VLOOKUP(Y73,Macronutrients,9,FALSE)*AC73+VLOOKUP(Y74,Macronutrients,9,FALSE)*AC74+VLOOKUP(Y75,Macronutrients,9,FALSE)*AC75+VLOOKUP(Y76,Macronutrients,9,FALSE)*AC76+VLOOKUP(Y77,Macronutrients,9,FALSE)*AC77+VLOOKUP(Y80,Micronutrients,9,FALSE)*AC80+VLOOKUP(Y81,Micronutrients,9,FALSE)*AC81+VLOOKUP(Y82,Micronutrients,9,FALSE)*AC82+VLOOKUP(Y83,Micronutrients,9,FALSE)*AC83","v":0},{"$f":"VLOOKUP(Y72,Macronutrients,10,FALSE)*AC72+VLOOKUP(Y73,Macronutrients,10,FALSE)*AC73+VLOOKUP(Y74,Macronutrients,10,FALSE)*AC74+VLOOKUP(Y75,Macronutrients,10,FALSE)*AC75+VLOOKUP(Y76,Macronutrients,10,FALSE)*AC76+VLOOKUP(Y77,Macronutrients,10,FALSE)*AC77+VLOOKUP(Y80,Micronutrients,10,FALSE)*AC80+VLOOKUP(Y81,Micronutrients,10,FALSE)*AC81+VLOOKUP(Y82,Micronutrients,10,FALSE)*AC82+VLOOKUP(Y83,Micronutrients,10,FALSE)*AC83","v":0}]
["Micronutrients (drop down menu)",null,null,null,null,null,null,null,null,null,null,null,"Micronutrients (drop down menu)",null,null,null,null,null,null,null,null,null,null,null,"Micronutrients (drop down menu)"]
["None",{"$f":"VLOOKUP($A80,Micronutrients,14,FALSE)","v":0},{"$f":"VLOOKUP(A80,Micronutrients,18,FALSE)","v":0},{"$f":"VLOOKUP(A80,Micronutrients,16,FALSE)","v":1},0,{"$f":"VLOOKUP(A80,Micronutrients,15,FALSE)","v":0},{"$f":"(E80*VLOOKUP(A80,Micronutrients,14,FALSE)/D80)*C80","v":0},null,"Cu","Mo","Fe",null,"None",{"$f":"VLOOKUP($M80,Micronutrients,14,FALSE)","v":0},{"$f":"VLOOKUP(M80,Micronutrients,18,FALSE)","v":0},{"$f":"VLOOKUP(M80,Micronutrients,16,FALSE)","v":1},0,{"$f":"VLOOKUP(M80,Micronutrients,15,FALSE)","v":0},{"$f":"(Q80*VLOOKUP(M80,Micronutrients,14,FALSE)/P80)*O80","v":0},null,"Cu","Mo","Fe",null,"None",{"$f":"VLOOKUP(Y80,Micronutrients,14,FALSE)","v":0},{"$f":"VLOOKUP(Y80,Micronutrients,18,FALSE)","v":0},{"$f":"VLOOKUP(Y80,Micronutrients,16,FALSE)","v":1},0,{"$f":"VLOOKUP(Y80,Micronutrients,15,FALSE)","v":0},{"$f":"(AC80*VLOOKUP(Y80,Micronutrients,14,FALSE)/AB80)*AA80","v":0},null,"Cu","Mo","Fe"]
["None",{"$f":"VLOOKUP($A81,Micronutrients,14,FALSE)","v":0},{"$f":"VLOOKUP(A81,Micronutrients,18,FALSE)","v":0},{"$f":"VLOOKUP(A81,Micronutrients,16,FALSE)","v":1},0,{"$f":"VLOOKUP(A81,Micronutrients,15,FALSE)","v":0},{"$f":"(E81*VLOOKUP(A81,Micronutrients,14,FALSE)/D81)*C81","v":0},null,{"$f":"VLOOKUP(A72,Macronutrients,11,FALSE)*E72+VLOOKUP(A73,Macronutrients,11,FALSE)*E73+VLOOKUP(A74,Macronutrients,11,FALSE)*E74+VLOOKUP(A75,Macronutrients,11,FALSE)*E75+VLOOKUP(A76,Macronutrients,11,FALSE)*E76+VLOOKUP(A77,Macronutrients,11,FALSE)*E77+VLOOKUP(A80,Micronutrients,11,FALSE)*E80+VLOOKUP(A81,Micronutrients,11,FALSE)*E81+VLOOKUP(A82,Micronutrients,11,FALSE)*E82+VLOOKUP(A83,Micronutrients,11,FALSE)*E83","v":0},{"$f":"VLOOKUP(A72,Macronutrients,12,FALSE)*E72+VLOOKUP(A73,Macronutrients,12,FALSE)*E73+VLOOKUP(A74,Macronutrients,12,FALSE)*E74+VLOOKUP(A75,Macronutrients,12,FALSE)*E75+VLOOKUP(A76,Macronutrients,12,FALSE)*E76+VLOOKUP(A77,Macronutrients,12,FALSE)*E77+VLOOKUP(A80,Micronutrients,12,FALSE)*E80+VLOOKUP(A81,Micronutrients,12,FALSE)*E81+VLOOKUP(A82,Micronutrients,12,FALSE)*E82+VLOOKUP(A83,Micronutrients,12,FALSE)*E83","v":0},{"$f":"VLOOKUP(A72,Macronutrients,13,FALSE)*E72+VLOOKUP(A73,Macronutrients,13,FALSE)*E73+VLOOKUP(A74,Macronutrients,13,FALSE)*E74+VLOOKUP(A75,Macronutrients,13,FALSE)*E75+VLOOKUP(A76,Macronutrients,13,FALSE)*E76+VLOOKUP(A77,Macronutrients,13,FALSE)*E77+VLOOKUP(A80,Micronutrients,13,FALSE)*E80+VLOOKUP(A81,Micronutrients,13,FALSE)*E81+VLOOKUP(A82,Micronutrients,13,FALSE)*E82+VLOOKUP(A83,Micronutrients,13,FALSE)*E83","v":0},null,"None",{"$f":"VLOOKUP($M81,Micronutrients,14,FALSE)","v":0},{"$f":"VLOOKUP(M81,Micronutrients,18,FALSE)","v":0},{"$f":"VLOOKUP(M81,Micronutrients,16,FALSE)","v":1},0,{"$f":"VLOOKUP(M81,Micronutrients,15,FALSE)","v":0},{"$f":"(Q81*VLOOKUP(M81,Micronutrients,14,FALSE)/P81)*O81","v":0},null,{"$f":"VLOOKUP(M72,Macronutrients,11,FALSE)*Q72+VLOOKUP(M73,Macronutrients,11,FALSE)*Q73+VLOOKUP(M74,Macronutrients,11,FALSE)*Q74+VLOOKUP(M75,Macronutrients,11,FALSE)*Q75+VLOOKUP(M76,Macronutrients,11,FALSE)*Q76+VLOOKUP(M77,Macronutrients,11,FALSE)*Q77+VLOOKUP(M80,Micronutrients,11,FALSE)*Q80+VLOOKUP(M81,Micronutrients,11,FALSE)*Q81+VLOOKUP(M82,Micronutrients,11,FALSE)*Q82+VLOOKUP(M83,Micronutrients,11,FALSE)*Q83","v":0},{"$f":"VLOOKUP(M72,Macronutrients,12,FALSE)*Q72+VLOOKUP(M73,Macronutrients,12,FALSE)*Q73+VLOOKUP(M74,Macronutrients,12,FALSE)*Q74+VLOOKUP(M75,Macronutrients,12,FALSE)*Q75+VLOOKUP(M76,Macronutrients,12,FALSE)*Q76+VLOOKUP(M77,Macronutrients,12,FALSE)*Q77+VLOOKUP(M80,Micronutrients,12,FALSE)*Q80+VLOOKUP(M81,Micronutrients,12,FALSE)*Q81+VLOOKUP(M82,Micronutrients,12,FALSE)*Q82+VLOOKUP(M83,Micronutrients,12,FALSE)*Q83","v":0},{"$f":"VLOOKUP(M72,Macronutrients,13,FALSE)*Q72+VLOOKUP(M73,Macronutrients,13,FALSE)*Q73+VLOOKUP(M74,Macronutrients,13,FALSE)*Q74+VLOOKUP(M75,Macronutrients,13,FALSE)*Q75+VLOOKUP(M76,Macronutrients,13,FALSE)*Q76+VLOOKUP(M77,Macronutrients,13,FALSE)*Q77+VLOOKUP(M80,Micronutrients,13,FALSE)*Q80+VLOOKUP(M81,Micronutrients,13,FALSE)*Q81+VLOOKUP(M82,Micronutrients,13,FALSE)*Q82+VLOOKUP(M83,Micronutrients,13,FALSE)*Q83","v":0},null,"None",{"$f":"VLOOKUP(Y81,Micronutrients,14,FALSE)","v":0},{"$f":"VLOOKUP(Y81,Micronutrients,18,FALSE)","v":0},{"$f":"VLOOKUP(Y81,Micronutrients,16,FALSE)","v":1},0,{"$f":"VLOOKUP(Y81,Micronutrients,15,FALSE)","v":0},{"$f":"(AC81*VLOOKUP(Y81,Micronutrients,14,FALSE)/AB81)*AA81","v":0},null,{"$f":"VLOOKUP(Y72,Macronutrients,11,FALSE)*AC72+VLOOKUP(Y73,Macronutrients,11,FALSE)*AC73+VLOOKUP(Y74,Macronutrients,11,FALSE)*AC74+VLOOKUP(Y75,Macronutrients,11,FALSE)*AC75+VLOOKUP(Y76,Macronutrients,11,FALSE)*AC76+VLOOKUP(Y77,Macronutrients,11,FALSE)*AC77+VLOOKUP(Y80,Micronutrients,11,FALSE)*AC80+VLOOKUP(Y81,Micronutrients,11,FALSE)*AC81+VLOOKUP(Y82,Micronutrients,11,FALSE)*AC82+VLOOKUP(Y83,Micronutrients,11,FALSE)*AC83","v":0},{"$f":"VLOOKUP(Y72,Macronutrients,12,FALSE)*AC72+VLOOKUP(Y73,Macronutrients,12,FALSE)*AC73+VLOOKUP(Y74,Macronutrients,12,FALSE)*AC74+VLOOKUP(Y75,Macronutrients,12,FALSE)*AC75+VLOOKUP(Y76,Macronutrients,12,FALSE)*AC76+VLOOKUP(Y77,Macronutrients,12,FALSE)*AC77+VLOOKUP(Y80,Micronutrients,12,FALSE)*AC80+VLOOKUP(Y81,Micronutrients,12,FALSE)*AC81+VLOOKUP(Y82,Micronutrients,12,FALSE)*AC82+VLOOKUP(Y83,Micronutrients,12,FALSE)*AC83","v":0},{"$f":"VLOOKUP(Y72,Macronutrients,13,FALSE)*AC72+VLOOKUP(Y73,Macronutrients,13,FALSE)*AC73+VLOOKUP(Y74,Macronutrients,13,FALSE)*AC74+VLOOKUP(Y75,Macronutrients,13,FALSE)*AC75+VLOOKUP(Y76,Macronutrients,13,FALSE)*AC76+VLOOKUP(Y77,Macronutrients,13,FALSE)*AC77+VLOOKUP(Y80,Micronutrients,13,FALSE)*AC80+VLOOKUP(Y81,Micronutrients,13,FALSE)*AC81+VLOOKUP(Y82,Micronutrients,13,FALSE)*AC82+VLOOKUP(Y83,Micronutrients,13,FALSE)*AC83","v":0}]
["None",{"$f":"VLOOKUP($A82,Micronutrients,14,FALSE)","v":0},{"$f":"VLOOKUP(A82,Micronutrients,18,FALSE)","v":0},{"$f":"VLOOKUP(A82,Micronutrients,16,FALSE)","v":1},0,{"$f":"VLOOKUP(A82,Micronutrients,15,FALSE)","v":0},{"$f":"(E82*VLOOKUP(A82,Micronutrients,14,FALSE)/D82)*C82","v":0},null,null,null,null,null,"None",{"$f":"VLOOKUP($M82,Micronutrients,14,FALSE)","v":0},{"$f":"VLOOKUP(M82,Micronutrients,18,FALSE)","v":0},{"$f":"VLOOKUP(M82,Micronutrients,16,FALSE)","v":1},0,{"$f":"VLOOKUP(M82,Micronutrients,15,FALSE)","v":0},{"$f":"(Q82*VLOOKUP(M82,Micronutrients,14,FALSE)/P82)*O82","v":0},null,null,null,null,null,"None",{"$f":"VLOOKUP(Y82,Micronutrients,14,FALSE)","v":0},{"$f":"VLOOKUP(Y82,Micronutrients,18,FALSE)","v":0},{"$f":"VLOOKUP(Y82,Micronutrients,16,FALSE)","v":1},0,{"$f":"VLOOKUP(Y82,Micronutrients,15,FALSE)","v":0},{"$f":"(AC82*VLOOKUP(Y82,Micronutrients,14,FALSE)/AB82)*AA82","v":0}]
["None",{"$f":"VLOOKUP($A83,Micronutrients,14,FALSE)","v":0},{"$f":"VLOOKUP(A83,Micronutrients,18,FALSE)","v":0},{"$f":"VLOOKUP(A83,Micronutrients,16,FALSE)","v":1},0,{"$f":"VLOOKUP(A83,Micronutrients,15,FALSE)","v":0},{"$f":"(E83*VLOOKUP(A83,Micronutrients,14,FALSE)/D83)*C83","v":0},null,null,null,null,null,"None",{"$f":"VLOOKUP($M83,Micronutrients,14,FALSE)","v":0},{"$f":"VLOOKUP(M83,Micronutrients,18,FALSE)","v":0},{"$f":"VLOOKUP(M83,Micronutrients,16,FALSE)","v":1},0,{"$f":"VLOOKUP(M83,Micronutrients,15,FALSE)","v":0},{"$f":"(Q83*VLOOKUP(M83,Micronutrients,14,FALSE)/P83)*O83","v":0},null,null,null,null,null,"None",{"$f":"VLOOKUP(Y83,Micronutrients,14,FALSE)","v":0},{"$f":"VLOOKUP(Y83,Micronutrients,18,FALSE)","v":0},{"$f":"VLOOKUP(Y83,Micronutrients,16,FALSE)","v":1},0,{"$f":"VLOOKUP(Y83,Micronutrients,15,FALSE)","v":0},{"$f":"(AC83*VLOOKUP(Y83,Micronutrients,14,FALSE)/AB83)*AA83","v":0}]
[]
["Nitrogen Stabilizers (drop down menu)",null,null,null,null,null,null,null,null,null,null,null,"Nitrogen Stabilizers (drop down menu)",null,null,null,null,null,null,null,null,null,null,null,"Nitrogen Stabilizers (drop down menu)"]
["None",{"$f":"VLOOKUP(A86,NitrogenStabilizers,14,FALSE)","v":0},{"$f":"VLOOKUP(A86,NitrogenStabilizers,18,FALSE)","v":0},{"$f":"VLOOKUP(A86,NitrogenStabilizers,16,FALSE)","v":1},0,{"$f":"VLOOKUP(A86,NitrogenStabilizers,15,FALSE)","v":0},{"$f":"(E86*VLOOKUP(A86,NitrogenStabilizers,14,FALSE)/D86)*C86","v":0},null,null,null,null,null,"None",{"$f":"VLOOKUP(M86,NitrogenStabilizers,14,FALSE)","v":0},{"$f":"VLOOKUP(M86,NitrogenStabilizers,18,FALSE)","v":0},{"$f":"VLOOKUP(M86,NitrogenStabilizers,16,FALSE)","v":1},0,{"$f":"VLOOKUP(M86,NitrogenStabilizers,15,FALSE)","v":0},{"$f":"(Q86*VLOOKUP(M86,NitrogenStabilizers,14,FALSE)/P86)*O86","v":0},null,null,null,null,null,"None",{"$f":"VLOOKUP(Y86,NitrogenStabilizers,14,FALSE)","v":0},{"$f":"VLOOKUP(Y86,NitrogenStabilizers,18,FALSE)","v":0},{"$f":"VLOOKUP(Y86,NitrogenStabilizers,16,FALSE)","v":1},0,{"$f":"VLOOKUP(Y86,NitrogenStabilizers,15,FALSE)","v":0},{"$f":"(AC86*VLOOKUP(Y86,NitrogenStabilizers,14,FALSE)/AB86)*AA86","v":0}]
["None",{"$f":"VLOOKUP(A87,NitrogenStabilizers,14,FALSE)","v":0},{"$f":"VLOOKUP(A87,NitrogenStabilizers,18,FALSE)","v":0},{"$f":"VLOOKUP(A87,NitrogenStabilizers,16,FALSE)","v":1},0,{"$f":"VLOOKUP(A87,NitrogenStabilizers,15,FALSE)","v":0},{"$f":"(E87*VLOOKUP(A87,NitrogenStabilizers,14,FALSE)/D87)*C87","v":0},null,null,null,"More",null,"None",{"$f":"VLOOKUP(M87,NitrogenStabilizers,14,FALSE)","v":0},{"$f":"VLOOKUP(M87,NitrogenStabilizers,18,FALSE)","v":0},{"$f":"VLOOKUP(M87,NitrogenStabilizers,16,FALSE)","v":1},0,{"$f":"VLOOKUP(M87,NitrogenStabilizers,15,FALSE)","v":0},{"$f":"(Q87*VLOOKUP(M87,NitrogenStabilizers,14,FALSE)/P87)*O87","v":0},null,null,null,"More",null,"None",{"$f":"VLOOKUP(Y87,NitrogenStabilizers,14,FALSE)","v":0},{"$f":"VLOOKUP(Y87,NitrogenStabilizers,18,FALSE)","v":0},{"$f":"VLOOKUP(Y87,NitrogenStabilizers,16,FALSE)","v":1},0,{"$f":"VLOOKUP(Y87,NitrogenStabilizers,15,FALSE)","v":0},{"$f":"(AC87*VLOOKUP(Y87,NitrogenStabilizers,14,FALSE)/AB87)*AA87","v":0},null,null,null,"More"]
["4th Application Fertilizer Cost/Acre",null,null,null,null,null,{"$f":"SUM(G72:G87)","v":0},null,null,null,"Below",null,"4th Application Fertilizer Cost/Acre",null,null,null,null,null,{"$f":"SUM(S72:S87)","v":0},null,null,null,"Below",null,"4th Application Fertilizer Cost/Acre",null,null,null,null,null,{"$f":"SUM(AE72:AE87)","v":0},null,null,null,"Below"]
[null,null,null,null,null,null,null,null,null,null,"¯",null,null,null,null,null,null,null,null,null,null,null,"¯",null,null,null,null,null,null,null,null,null,null,null,"¯"]
["5th Application (i.e., Side-Dress or Broadcast or Fertigation)",null,null,null,null,null,null,null,null,null,null,null,"5th Application (i.e., Side-Dress or Broadcast or Fertigation)",null,null,null,null,null,null,null,null,null,null,null,"5th Application (i.e., Side-Dress or Broadcast or Fertigation)"]
["Fertilizer Source","Purchase Units","Package Price (Gals, Lbs, etc.)","Units/Pkg","Rate/Acre","Units","Cost",null,null,null,null,null,"Fertilizer Source","Purchase Units","Package Price (Gals, Lbs, etc.)","Units/Pkg","Rate/Acre","Units","Cost",null,null,null,null,null,"Fertilizer Source","Purchase Units","Package Price (Gals, Lbs, etc.)","Units/Pkg","Rate/Acre","Units","Cost"]
["Macronutrients (drop down menu)",null,null,null,"(Enter Below)",null,null,null,"N","P","K",null,"Macronutrients (drop down menu)",null,null,null,"(Enter Below)",null,null,null,"N","P","K",null,"Macronutrients (drop down menu)",null,null,null,"(Enter Below)",null,null,null,"N","P","K"]
["None",{"$f":"VLOOKUP(A93,Macronutrients,14,FALSE)","v":0},{"$f":"VLOOKUP(A93,Macronutrients,18,FALSE)","v":0},{"$f":"VLOOKUP(A93,Macronutrients,16,FALSE)","v":1},0,{"$f":"VLOOKUP(A93,Macronutrients,15,FALSE)","v":0},{"$f":"(E93*VLOOKUP(A93,Macronutrients,14,FALSE)/D93)*C93","v":0},null,{"$f":"VLOOKUP(A93,Macronutrients,2,FALSE)*E93+VLOOKUP(A94,Macronutrients,2,FALSE)*E94+VLOOKUP(A95,Macronutrients,2,FALSE)*E95+VLOOKUP(A96,Macronutrients,2,FALSE)*E96+VLOOKUP(A97,Macronutrients,2,FALSE)*E97+VLOOKUP(A98,Macronutrients,2,FALSE)*E98+VLOOKUP(A101,Micronutrients,2,FALSE)*E101+VLOOKUP(A102,Micronutrients,2,FALSE)*E102+VLOOKUP(A103,Micronutrients,2,FALSE)*E103+VLOOKUP(A104,Micronutrients,2,FALSE)*E104","v":0},{"$f":"VLOOKUP(A93,Macronutrients,3,FALSE)*E93+VLOOKUP(A94,Macronutrients,3,FALSE)*E94+VLOOKUP(A95,Macronutrients,3,FALSE)*E95+VLOOKUP(A96,Macronutrients,3,FALSE)*E96+VLOOKUP(A97,Macronutrients,3,FALSE)*E97+VLOOKUP(A98,Macronutrients,3,FALSE)*E98+VLOOKUP(A101,Micronutrients,3,FALSE)*E101+VLOOKUP(A102,Micronutrients,3,FALSE)*E102+VLOOKUP(A103,Micronutrients,3,FALSE)*E103+VLOOKUP(A104,Micronutrients,3,FALSE)*E104","v":0},{"$f":"VLOOKUP(A93,Macronutrients,4,FALSE)*E93+VLOOKUP(A94,Macronutrients,4,FALSE)*E94+VLOOKUP(A95,Macronutrients,4,FALSE)*E95+VLOOKUP(A96,Macronutrients,4,FALSE)*E96+VLOOKUP(A97,Macronutrients,4,FALSE)*E97+VLOOKUP(A98,Macronutrients,4,FALSE)*E98+VLOOKUP(A101,Micronutrients,4,FALSE)*E101+VLOOKUP(A102,Micronutrients,4,FALSE)*E102+VLOOKUP(A103,Micronutrients,4,FALSE)*E103+VLOOKUP(A104,Micronutrients,4,FALSE)*E104","v":0},null,"None",{"$f":"VLOOKUP(M93,Macronutrients,14,FALSE)","v":0},{"$f":"VLOOKUP(M93,Macronutrients,18,FALSE)","v":0},{"$f":"VLOOKUP(M93,Macronutrients,16,FALSE)","v":1},0,{"$f":"VLOOKUP(M93,Macronutrients,15,FALSE)","v":0},{"$f":"(Q93*VLOOKUP(M93,Macronutrients,14,FALSE)/P93)*O93","v":0},null,{"$f":"VLOOKUP(M93,Macronutrients,2,FALSE)*Q93+VLOOKUP(M94,Macronutrients,2,FALSE)*Q94+VLOOKUP(M95,Macronutrients,2,FALSE)*Q95+VLOOKUP(M96,Macronutrients,2,FALSE)*Q96+VLOOKUP(M97,Macronutrients,2,FALSE)*Q97+VLOOKUP(M98,Macronutrients,2,FALSE)*Q98+VLOOKUP(M101,Micronutrients,2,FALSE)*Q101+VLOOKUP(M102,Micronutrients,2,FALSE)*Q102+VLOOKUP(M103,Micronutrients,2,FALSE)*Q103+VLOOKUP(M104,Micronutrients,2,FALSE)*Q104","v":0},{"$f":"VLOOKUP(M93,Macronutrients,3,FALSE)*Q93+VLOOKUP(M94,Macronutrients,3,FALSE)*Q94+VLOOKUP(M95,Macronutrients,3,FALSE)*Q95+VLOOKUP(M96,Macronutrients,3,FALSE)*Q96+VLOOKUP(M97,Macronutrients,3,FALSE)*Q97+VLOOKUP(M98,Macronutrients,3,FALSE)*Q98+VLOOKUP(M101,Micronutrients,3,FALSE)*Q101+VLOOKUP(M102,Micronutrients,3,FALSE)*Q102+VLOOKUP(M103,Micronutrients,3,FALSE)*Q103+VLOOKUP(M104,Micronutrients,3,FALSE)*Q104","v":0},{"$f":"VLOOKUP(M93,Macronutrients,4,FALSE)*Q93+VLOOKUP(M94,Macronutrients,4,FALSE)*Q94+VLOOKUP(M95,Macronutrients,4,FALSE)*Q95+VLOOKUP(M96,Macronutrients,4,FALSE)*Q96+VLOOKUP(M97,Macronutrients,4,FALSE)*Q97+VLOOKUP(M98,Macronutrients,4,FALSE)*Q98+VLOOKUP(M101,Micronutrients,4,FALSE)*Q101+VLOOKUP(M102,Micronutrients,4,FALSE)*Q102+VLOOKUP(M103,Micronutrients,4,FALSE)*Q103+VLOOKUP(M104,Micronutrients,4,FALSE)*Q104","v":0},null,"None",{"$f":"VLOOKUP(Y93,Macronutrients,14,FALSE)","v":0},{"$f":"VLOOKUP(Y93,Macronutrients,18,FALSE)","v":0},{"$f":"VLOOKUP(Y93,Macronutrients,16,FALSE)","v":1},0,{"$f":"VLOOKUP(Y93,Macronutrients,15,FALSE)","v":0},{"$f":"(AC93*VLOOKUP(Y93,Macronutrients,14,FALSE)/AB93)*AA93","v":0},null,{"$f":"VLOOKUP(Y93,Macronutrients,2,FALSE)*AC93+VLOOKUP(Y94,Macronutrients,2,FALSE)*AC94+VLOOKUP(Y95,Macronutrients,2,FALSE)*AC95+VLOOKUP(Y96,Macronutrients,2,FALSE)*AC96+VLOOKUP(Y97,Macronutrients,2,FALSE)*AC97+VLOOKUP(Y98,Macronutrients,2,FALSE)*AC98+VLOOKUP(Y101,Micronutrients,2,FALSE)*AC101+VLOOKUP(Y102,Micronutrients,2,FALSE)*AC102+VLOOKUP(Y103,Micronutrients,2,FALSE)*AC103+VLOOKUP(Y104,Micronutrients,2,FALSE)*AC104","v":0},{"$f":"VLOOKUP(Y93,Macronutrients,3,FALSE)*AC93+VLOOKUP(Y94,Macronutrients,3,FALSE)*AC94+VLOOKUP(Y95,Macronutrients,3,FALSE)*AC95+VLOOKUP(Y96,Macronutrients,3,FALSE)*AC96+VLOOKUP(Y97,Macronutrients,3,FALSE)*AC97+VLOOKUP(Y98,Macronutrients,3,FALSE)*AC98+VLOOKUP(Y101,Micronutrients,3,FALSE)*AC101+VLOOKUP(Y102,Micronutrients,3,FALSE)*AC102+VLOOKUP(Y103,Micronutrients,3,FALSE)*AC103+VLOOKUP(Y104,Micronutrients,3,FALSE)*AC104","v":0},{"$f":"VLOOKUP(Y93,Macronutrients,4,FALSE)*AC93+VLOOKUP(Y94,Macronutrients,4,FALSE)*AC94+VLOOKUP(Y95,Macronutrients,4,FALSE)*AC95+VLOOKUP(Y96,Macronutrients,4,FALSE)*AC96+VLOOKUP(Y97,Macronutrients,4,FALSE)*AC97+VLOOKUP(Y98,Macronutrients,4,FALSE)*AC98+VLOOKUP(Y101,Micronutrients,4,FALSE)*AC101+VLOOKUP(Y102,Micronutrients,4,FALSE)*AC102+VLOOKUP(Y103,Micronutrients,4,FALSE)*AC103+VLOOKUP(Y104,Micronutrients,4,FALSE)*AC104","v":0}]
["None",0,0,1,0,0,0,null,null,null,null,null,"None",{"$f":"VLOOKUP(M94,Macronutrients,14,FALSE)","v":0},0,1,0,0,0,null,null,null,null,null,"None",0,0,1,0,0,0]
["None",0,0,1,0,0,0,null,"S","Ca","Mg",null,"None",0,0,1,0,0,0,null,"S","Ca","Mg",null,"None",0,0,1,0,0,0,null,"S","Ca","Mg"]
["None",0,0,1,0,0,0,null,{"$f":"VLOOKUP(A93,Macronutrients,5,FALSE)*E93+VLOOKUP(A94,Macronutrients,5,FALSE)*E94+VLOOKUP(A95,Macronutrients,5,FALSE)*E95+VLOOKUP(A96,Macronutrients,5,FALSE)*E96+VLOOKUP(A97,Macronutrients,5,FALSE)*E97+VLOOKUP(A98,Macronutrients,5,FALSE)*E98+VLOOKUP(A101,Micronutrients,5,FALSE)*E101+VLOOKUP(A102,Micronutrients,5,FALSE)*E102+VLOOKUP(A103,Micronutrients,5,FALSE)*E103+VLOOKUP(A104,Micronutrients,5,FALSE)*E104","v":0},{"$f":"VLOOKUP(A93,Macronutrients,7,FALSE)*E93+VLOOKUP(A94,Macronutrients,7,FALSE)*E94+VLOOKUP(A95,Macronutrients,7,FALSE)*E95+VLOOKUP(A96,Macronutrients,7,FALSE)*E96+VLOOKUP(A97,Macronutrients,7,FALSE)*E97+VLOOKUP(A98,Macronutrients,7,FALSE)*E98+VLOOKUP(A101,Micronutrients,7,FALSE)*E101+VLOOKUP(A102,Micronutrients,7,FALSE)*E102+VLOOKUP(A103,Micronutrients,7,FALSE)*E103+VLOOKUP(A104,Micronutrients,7,FALSE)*E104","v":0},{"$f":"VLOOKUP($A93,Macronutrients,6,FALSE)*$E$6+VLOOKUP($A94,Macronutrients,6,FALSE)*$E$7+VLOOKUP($A95,Macronutrients,6,FALSE)*$E$8+VLOOKUP($A96,Macronutrients,6,FALSE)*$E$9+VLOOKUP($A97,Macronutrients,6,FALSE)*$E$10+VLOOKUP($A98,Macronutrients,6,FALSE)*$E$11+VLOOKUP($A101,Micronutrients,6,FALSE)*$E$14+VLOOKUP($A102,Micronutrients,6,FALSE)*E102+VLOOKUP($A103,Micronutrients,6,FALSE)*$E$16+VLOOKUP($A104,Micronutrients,6,FALSE)*$E$17","v":0},null,"None",0,0,1,0,0,0,null,{"$f":"VLOOKUP(M93,Macronutrients,5,FALSE)*Q93+VLOOKUP(M94,Macronutrients,5,FALSE)*Q94+VLOOKUP(M95,Macronutrients,5,FALSE)*Q95+VLOOKUP(M96,Macronutrients,5,FALSE)*Q96+VLOOKUP(M97,Macronutrients,5,FALSE)*Q97+VLOOKUP(M98,Macronutrients,5,FALSE)*Q98+VLOOKUP(M101,Micronutrients,5,FALSE)*Q101+VLOOKUP(M102,Micronutrients,5,FALSE)*Q102+VLOOKUP(M103,Micronutrients,5,FALSE)*Q103+VLOOKUP(M104,Micronutrients,5,FALSE)*Q104","v":0},{"$f":"VLOOKUP(M93,Macronutrients,7,FALSE)*Q93+VLOOKUP(M94,Macronutrients,7,FALSE)*Q94+VLOOKUP(M95,Macronutrients,7,FALSE)*Q95+VLOOKUP(M96,Macronutrients,7,FALSE)*Q96+VLOOKUP(M97,Macronutrients,7,FALSE)*Q97+VLOOKUP(M98,Macronutrients,7,FALSE)*Q98+VLOOKUP(M101,Micronutrients,7,FALSE)*Q101+VLOOKUP(M102,Micronutrients,7,FALSE)*Q102+VLOOKUP(M103,Micronutrients,7,FALSE)*Q103+VLOOKUP(M104,Micronutrients,7,FALSE)*Q104","v":0},{"$f":"VLOOKUP($A93,Macronutrients,6,FALSE)*$E$6+VLOOKUP($A94,Macronutrients,6,FALSE)*$E$7+VLOOKUP($A95,Macronutrients,6,FALSE)*$E$8+VLOOKUP($A96,Macronutrients,6,FALSE)*$E$9+VLOOKUP($A97,Macronutrients,6,FALSE)*$E$10+VLOOKUP($A98,Macronutrients,6,FALSE)*$E$11+VLOOKUP($A101,Micronutrients,6,FALSE)*$E$14+VLOOKUP($A102,Micronutrients,6,FALSE)*Q102+VLOOKUP($A103,Micronutrients,6,FALSE)*$E$16+VLOOKUP($A104,Micronutrients,6,FALSE)*$E$17","v":0},null,"None",0,0,1,0,0,0,null,{"$f":"VLOOKUP(Y93,Macronutrients,5,FALSE)*AC93+VLOOKUP(Y94,Macronutrients,5,FALSE)*AC94+VLOOKUP(Y95,Macronutrients,5,FALSE)*AC95+VLOOKUP(Y96,Macronutrients,5,FALSE)*AC96+VLOOKUP(Y97,Macronutrients,5,FALSE)*AC97+VLOOKUP(Y98,Macronutrients,5,FALSE)*AC98+VLOOKUP(Y101,Micronutrients,5,FALSE)*AC101+VLOOKUP(Y102,Micronutrients,5,FALSE)*AC102+VLOOKUP(Y103,Micronutrients,5,FALSE)*AC103+VLOOKUP(Y104,Micronutrients,5,FALSE)*AC104","v":0},{"$f":"VLOOKUP(Y93,Macronutrients,7,FALSE)*AC93+VLOOKUP(Y94,Macronutrients,7,FALSE)*AC94+VLOOKUP(Y95,Macronutrients,7,FALSE)*AC95+VLOOKUP(Y96,Macronutrients,7,FALSE)*AC96+VLOOKUP(Y97,Macronutrients,7,FALSE)*AC97+VLOOKUP(Y98,Macronutrients,7,FALSE)*AC98+VLOOKUP(Y101,Micronutrients,7,FALSE)*AC101+VLOOKUP(Y102,Micronutrients,7,FALSE)*AC102+VLOOKUP(Y103,Micronutrients,7,FALSE)*AC103+VLOOKUP(Y104,Micronutrients,7,FALSE)*AC104","v":0},{"$f":"VLOOKUP($A93,Macronutrients,6,FALSE)*$E$6+VLOOKUP($A94,Macronutrients,6,FALSE)*$E$7+VLOOKUP($A95,Macronutrients,6,FALSE)*$E$8+VLOOKUP($A96,Macronutrients,6,FALSE)*$E$9+VLOOKUP($A97,Macronutrients,6,FALSE)*$E$10+VLOOKUP($A98,Macronutrients,6,FALSE)*$E$11+VLOOKUP($A101,Micronutrients,6,FALSE)*$E$14+VLOOKUP($A102,Micronutrients,6,FALSE)*AC102+VLOOKUP($A103,Micronutrients,6,FALSE)*$E$16+VLOOKUP($A104,Micronutrients,6,FALSE)*$E$17","v":0}]
["None",0,0,1,0,0,0,null,null,null,null,null,"None",0,0,1,0,0,0,null,null,null,null,null,"None",0,0,1,0,0,0]
["None",0,0,1,0,0,0,null,"Z","B","Mn",null,"None",0,0,1,0,0,0,null,"Z","B","Mn",null,"None",0,0,1,0,0,0,null,"Z","B","Mn"]
[null,null,null,null,null,null,null,null,{"$f":"VLOOKUP(A93,Macronutrients,8,FALSE)*E93+VLOOKUP(A94,Macronutrients,8,FALSE)*E94+VLOOKUP(A95,Macronutrients,8,FALSE)*E95+VLOOKUP(A96,Macronutrients,8,FALSE)*E96+VLOOKUP(A97,Macronutrients,8,FALSE)*E97+VLOOKUP(A98,Macronutrients,8,FALSE)*E98+VLOOKUP(A101,Micronutrients,8,FALSE)*E101+VLOOKUP(A102,Micronutrients,8,FALSE)*E102+VLOOKUP(A103,Micronutrients,8,FALSE)*E103+VLOOKUP(A104,Micronutrients,8,FALSE)*E104","v":0},{"$f":"VLOOKUP(A93,Macronutrients,9,FALSE)*E93+VLOOKUP(A94,Macronutrients,9,FALSE)*E94+VLOOKUP(A95,Macronutrients,9,FALSE)*E95+VLOOKUP(A96,Macronutrients,9,FALSE)*E96+VLOOKUP(A97,Macronutrients,9,FALSE)*E97+VLOOKUP(A98,Macronutrients,9,FALSE)*E98+VLOOKUP(A101,Micronutrients,9,FALSE)*E101+VLOOKUP(A102,Micronutrients,9,FALSE)*E102+VLOOKUP(A103,Micronutrients,9,FALSE)*E103+VLOOKUP(A104,Micronutrients,9,FALSE)*E104","v":0},{"$f":"VLOOKUP(A93,Macronutrients,10,FALSE)*E93+VLOOKUP(A94,Macronutrients,10,FALSE)*E94+VLOOKUP(A95,Macronutrients,10,FALSE)*E95+VLOOKUP(A96,Macronutrients,10,FALSE)*E96+VLOOKUP(A97,Macronutrients,10,FALSE)*E97+VLOOKUP(A98,Macronutrients,10,FALSE)*E98+VLOOKUP(A101,Micronutrients,10,FALSE)*E101+VLOOKUP(A102,Micronutrients,10,FALSE)*E102+VLOOKUP(A103,Micronutrients,10,FALSE)*E103+VLOOKUP(A104,Micronutrients,10,FALSE)*E104","v":0},null,null,null,null,null,null,null,null,null,{"$f":"VLOOKUP(M93,Macronutrients,8,FALSE)*Q93+VLOOKUP(M94,Macronutrients,8,FALSE)*Q94+VLOOKUP(M95,Macronutrients,8,FALSE)*Q95+VLOOKUP(M96,Macronutrients,8,FALSE)*Q96+VLOOKUP(M97,Macronutrients,8,FALSE)*Q97+VLOOKUP(M98,Macronutrients,8,FALSE)*Q98+VLOOKUP(M101,Micronutrients,8,FALSE)*Q101+VLOOKUP(M102,Micronutrients,8,FALSE)*Q102+VLOOKUP(M103,Micronutrients,8,FALSE)*Q103+VLOOKUP(M104,Micronutrients,8,FALSE)*Q104","v":0},{"$f":"VLOOKUP(M93,Macronutrients,9,FALSE)*Q93+VLOOKUP(M94,Macronutrients,9,FALSE)*Q94+VLOOKUP(M95,Macronutrients,9,FALSE)*Q95+VLOOKUP(M96,Macronutrients,9,FALSE)*Q96+VLOOKUP(M97,Macronutrients,9,FALSE)*Q97+VLOOKUP(M98,Macronutrients,9,FALSE)*Q98+VLOOKUP(M101,Micronutrients,9,FALSE)*Q101+VLOOKUP(M102,Micronutrients,9,FALSE)*Q102+VLOOKUP(M103,Micronutrients,9,FALSE)*Q103+VLOOKUP(M104,Micronutrients,9,FALSE)*Q104","v":0},{"$f":"VLOOKUP(M93,Macronutrients,10,FALSE)*Q93+VLOOKUP(M94,Macronutrients,10,FALSE)*Q94+VLOOKUP(M95,Macronutrients,10,FALSE)*Q95+VLOOKUP(M96,Macronutrients,10,FALSE)*Q96+VLOOKUP(M97,Macronutrients,10,FALSE)*Q97+VLOOKUP(M98,Macronutrients,10,FALSE)*Q98+VLOOKUP(M101,Micronutrients,10,FALSE)*Q101+VLOOKUP(M102,Micronutrients,10,FALSE)*Q102+VLOOKUP(M103,Micronutrients,10,FALSE)*Q103+VLOOKUP(M104,Micronutrients,10,FALSE)*Q104","v":0},null,null,null,null,null,null,null,null,null,{"$f":"VLOOKUP(Y93,Macronutrients,8,FALSE)*AC93+VLOOKUP(Y94,Macronutrients,8,FALSE)*AC94+VLOOKUP(Y95,Macronutrients,8,FALSE)*AC95+VLOOKUP(Y96,Macronutrients,8,FALSE)*AC96+VLOOKUP(Y97,Macronutrients,8,FALSE)*AC97+VLOOKUP(Y98,Macronutrients,8,FALSE)*AC98+VLOOKUP(Y101,Micronutrients,8,FALSE)*AC101+VLOOKUP(Y102,Micronutrients,8,FALSE)*AC102+VLOOKUP(Y103,Micronutrients,8,FALSE)*AC103+VLOOKUP(Y104,Micronutrients,8,FALSE)*AC104","v":0},{"$f":"VLOOKUP(Y93,Macronutrients,9,FALSE)*AC93+VLOOKUP(Y94,Macronutrients,9,FALSE)*AC94+VLOOKUP(Y95,Macronutrients,9,FALSE)*AC95+VLOOKUP(Y96,Macronutrients,9,FALSE)*AC96+VLOOKUP(Y97,Macronutrients,9,FALSE)*AC97+VLOOKUP(Y98,Macronutrients,9,FALSE)*AC98+VLOOKUP(Y101,Micronutrients,9,FALSE)*AC101+VLOOKUP(Y102,Micronutrients,9,FALSE)*AC102+VLOOKUP(Y103,Micronutrients,9,FALSE)*AC103+VLOOKUP(Y104,Micronutrients,9,FALSE)*AC104","v":0},{"$f":"VLOOKUP(Y93,Macronutrients,10,FALSE)*AC93+VLOOKUP(Y94,Macronutrients,10,FALSE)*AC94+VLOOKUP(Y95,Macronutrients,10,FALSE)*AC95+VLOOKUP(Y96,Macronutrients,10,FALSE)*AC96+VLOOKUP(Y97,Macronutrients,10,FALSE)*AC97+VLOOKUP(Y98,Macronutrients,10,FALSE)*AC98+VLOOKUP(Y101,Micronutrients,10,FALSE)*AC101+VLOOKUP(Y102,Micronutrients,10,FALSE)*AC102+VLOOKUP(Y103,Micronutrients,10,FALSE)*AC103+VLOOKUP(Y104,Micronutrients,10,FALSE)*AC104","v":0}]
["Micronutrients (drop down menu)",null,null,null,null,null,null,null,null,null,null,null,"Micronutrients (drop down menu)",null,null,null,null,null,null,null,null,null,null,null,"Micronutrients (drop down menu)"]
["None",{"$f":"VLOOKUP($A101,Micronutrients,14,FALSE)","v":0},{"$f":"VLOOKUP(A101,Micronutrients,18,FALSE)","v":0},{"$f":"VLOOKUP(A101,Micronutrients,16,FALSE)","v":1},0,{"$f":"VLOOKUP(A101,Micronutrients,15,FALSE)","v":0},{"$f":"(E101*VLOOKUP(A101,Micronutrients,14,FALSE)/D101)*C101","v":0},null,"Cu","Mo","Fe",null,"None",{"$f":"VLOOKUP($M101,Micronutrients,14,FALSE)","v":0},{"$f":"VLOOKUP(M101,Micronutrients,18,FALSE)","v":0},{"$f":"VLOOKUP(M101,Micronutrients,16,FALSE)","v":1},0,{"$f":"VLOOKUP(M101,Micronutrients,15,FALSE)","v":0},{"$f":"(Q101*VLOOKUP(M101,Micronutrients,14,FALSE)/P101)*O101","v":0},null,"Cu","Mo","Fe",null,"None",{"$f":"VLOOKUP(Y101,Micronutrients,14,FALSE)","v":0},{"$f":"VLOOKUP(Y101,Micronutrients,18,FALSE)","v":0},{"$f":"VLOOKUP(Y101,Micronutrients,16,FALSE)","v":1},0,{"$f":"VLOOKUP(Y101,Micronutrients,15,FALSE)","v":0},{"$f":"(AC101*VLOOKUP(Y101,Micronutrients,14,FALSE)/AB101)*AA101","v":0},null,"Cu","Mo","Fe"]
["None",{"$f":"VLOOKUP($A102,Micronutrients,14,FALSE)","v":0},{"$f":"VLOOKUP(A102,Micronutrients,18,FALSE)","v":0},{"$f":"VLOOKUP(A102,Micronutrients,16,FALSE)","v":1},0,{"$f":"VLOOKUP(A102,Micronutrients,15,FALSE)","v":0},{"$f":"(E102*VLOOKUP(A102,Micronutrients,14,FALSE)/D102)*C102","v":0},null,{"$f":"VLOOKUP(A93,Macronutrients,11,FALSE)*E93+VLOOKUP(A94,Macronutrients,11,FALSE)*E94+VLOOKUP(A95,Macronutrients,11,FALSE)*E95+VLOOKUP(A96,Macronutrients,11,FALSE)*E96+VLOOKUP(A97,Macronutrients,11,FALSE)*E97+VLOOKUP(A98,Macronutrients,11,FALSE)*E98+VLOOKUP(A101,Micronutrients,11,FALSE)*E101+VLOOKUP(A102,Micronutrients,11,FALSE)*E102+VLOOKUP(A103,Micronutrients,11,FALSE)*E103+VLOOKUP(A104,Micronutrients,11,FALSE)*E104","v":0},{"$f":"VLOOKUP(A93,Macronutrients,12,FALSE)*E93+VLOOKUP(A94,Macronutrients,12,FALSE)*E94+VLOOKUP(A95,Macronutrients,12,FALSE)*E95+VLOOKUP(A96,Macronutrients,12,FALSE)*E96+VLOOKUP(A97,Macronutrients,12,FALSE)*E97+VLOOKUP(A98,Macronutrients,12,FALSE)*E98+VLOOKUP(A101,Micronutrients,12,FALSE)*E101+VLOOKUP(A102,Micronutrients,12,FALSE)*E102+VLOOKUP(A103,Micronutrients,12,FALSE)*E103+VLOOKUP(A104,Micronutrients,12,FALSE)*E104","v":0},{"$f":"VLOOKUP(A93,Macronutrients,13,FALSE)*E93+VLOOKUP(A94,Macronutrients,13,FALSE)*E94+VLOOKUP(A95,Macronutrients,13,FALSE)*E95+VLOOKUP(A96,Macronutrients,13,FALSE)*E96+VLOOKUP(A97,Macronutrients,13,FALSE)*E97+VLOOKUP(A98,Macronutrients,13,FALSE)*E98+VLOOKUP(A101,Micronutrients,13,FALSE)*E101+VLOOKUP(A102,Micronutrients,13,FALSE)*E102+VLOOKUP(A103,Micronutrients,13,FALSE)*E103+VLOOKUP(A104,Micronutrients,13,FALSE)*E104","v":0},null,"None",{"$f":"VLOOKUP($M102,Micronutrients,14,FALSE)","v":0},{"$f":"VLOOKUP(M102,Micronutrients,18,FALSE)","v":0},{"$f":"VLOOKUP(M102,Micronutrients,16,FALSE)","v":1},0,{"$f":"VLOOKUP(M102,Micronutrients,15,FALSE)","v":0},{"$f":"(Q102*VLOOKUP(M102,Micronutrients,14,FALSE)/P102)*O102","v":0},null,{"$f":"VLOOKUP(M93,Macronutrients,11,FALSE)*Q93+VLOOKUP(M94,Macronutrients,11,FALSE)*Q94+VLOOKUP(M95,Macronutrients,11,FALSE)*Q95+VLOOKUP(M96,Macronutrients,11,FALSE)*Q96+VLOOKUP(M97,Macronutrients,11,FALSE)*Q97+VLOOKUP(M98,Macronutrients,11,FALSE)*Q98+VLOOKUP(M101,Micronutrients,11,FALSE)*Q101+VLOOKUP(M102,Micronutrients,11,FALSE)*Q102+VLOOKUP(M103,Micronutrients,11,FALSE)*Q103+VLOOKUP(M104,Micronutrients,11,FALSE)*Q104","v":0},{"$f":"VLOOKUP(M93,Macronutrients,12,FALSE)*Q93+VLOOKUP(M94,Macronutrients,12,FALSE)*Q94+VLOOKUP(M95,Macronutrients,12,FALSE)*Q95+VLOOKUP(M96,Macronutrients,12,FALSE)*Q96+VLOOKUP(M97,Macronutrients,12,FALSE)*Q97+VLOOKUP(M98,Macronutrients,12,FALSE)*Q98+VLOOKUP(M101,Micronutrients,12,FALSE)*Q101+VLOOKUP(M102,Micronutrients,12,FALSE)*Q102+VLOOKUP(M103,Micronutrients,12,FALSE)*Q103+VLOOKUP(M104,Micronutrients,12,FALSE)*Q104","v":0},{"$f":"VLOOKUP(M93,Macronutrients,13,FALSE)*Q93+VLOOKUP(M94,Macronutrients,13,FALSE)*Q94+VLOOKUP(M95,Macronutrients,13,FALSE)*Q95+VLOOKUP(M96,Macronutrients,13,FALSE)*Q96+VLOOKUP(M97,Macronutrients,13,FALSE)*Q97+VLOOKUP(M98,Macronutrients,13,FALSE)*Q98+VLOOKUP(M101,Micronutrients,13,FALSE)*Q101+VLOOKUP(M102,Micronutrients,13,FALSE)*Q102+VLOOKUP(M103,Micronutrients,13,FALSE)*Q103+VLOOKUP(M104,Micronutrients,13,FALSE)*Q104","v":0},null,"None",{"$f":"VLOOKUP(Y102,Micronutrients,14,FALSE)","v":0},{"$f":"VLOOKUP(Y102,Micronutrients,18,FALSE)","v":0},{"$f":"VLOOKUP(Y102,Micronutrients,16,FALSE)","v":1},0,{"$f":"VLOOKUP(Y102,Micronutrients,15,FALSE)","v":0},{"$f":"(AC102*VLOOKUP(Y102,Micronutrients,14,FALSE)/AB102)*AA102","v":0},null,{"$f":"VLOOKUP(Y93,Macronutrients,11,FALSE)*AC93+VLOOKUP(Y94,Macronutrients,11,FALSE)*AC94+VLOOKUP(Y95,Macronutrients,11,FALSE)*AC95+VLOOKUP(Y96,Macronutrients,11,FALSE)*AC96+VLOOKUP(Y97,Macronutrients,11,FALSE)*AC97+VLOOKUP(Y98,Macronutrients,11,FALSE)*AC98+VLOOKUP(Y101,Micronutrients,11,FALSE)*AC101+VLOOKUP(Y102,Micronutrients,11,FALSE)*AC102+VLOOKUP(Y103,Micronutrients,11,FALSE)*AC103+VLOOKUP(Y104,Micronutrients,11,FALSE)*AC104","v":0},{"$f":"VLOOKUP(Y93,Macronutrients,12,FALSE)*AC93+VLOOKUP(Y94,Macronutrients,12,FALSE)*AC94+VLOOKUP(Y95,Macronutrients,12,FALSE)*AC95+VLOOKUP(Y96,Macronutrients,12,FALSE)*AC96+VLOOKUP(Y97,Macronutrients,12,FALSE)*AC97+VLOOKUP(Y98,Macronutrients,12,FALSE)*AC98+VLOOKUP(Y101,Micronutrients,12,FALSE)*AC101+VLOOKUP(Y102,Micronutrients,12,FALSE)*AC102+VLOOKUP(Y103,Micronutrients,12,FALSE)*AC103+VLOOKUP(Y104,Micronutrients,12,FALSE)*AC104","v":0},{"$f":"VLOOKUP(Y93,Macronutrients,13,FALSE)*AC93+VLOOKUP(Y94,Macronutrients,13,FALSE)*AC94+VLOOKUP(Y95,Macronutrients,13,FALSE)*AC95+VLOOKUP(Y96,Macronutrients,13,FALSE)*AC96+VLOOKUP(Y97,Macronutrients,13,FALSE)*AC97+VLOOKUP(Y98,Macronutrients,13,FALSE)*AC98+VLOOKUP(Y101,Micronutrients,13,FALSE)*AC101+VLOOKUP(Y102,Micronutrients,13,FALSE)*AC102+VLOOKUP(Y103,Micronutrients,13,FALSE)*AC103+VLOOKUP(Y104,Micronutrients,13,FALSE)*AC104","v":0}]
["None",{"$f":"VLOOKUP($A103,Micronutrients,14,FALSE)","v":0},{"$f":"VLOOKUP(A103,Micronutrients,18,FALSE)","v":0},{"$f":"VLOOKUP(A103,Micronutrients,16,FALSE)","v":1},0,{"$f":"VLOOKUP(A103,Micronutrients,15,FALSE)","v":0},{"$f":"(E103*VLOOKUP(A103,Micronutrients,14,FALSE)/D103)*C103","v":0},null,null,null,null,null,"None",{"$f":"VLOOKUP($M103,Micronutrients,14,FALSE)","v":0},{"$f":"VLOOKUP(M103,Micronutrients,18,FALSE)","v":0},{"$f":"VLOOKUP(M103,Micronutrients,16,FALSE)","v":1},0,{"$f":"VLOOKUP(M103,Micronutrients,15,FALSE)","v":0},{"$f":"(Q103*VLOOKUP(M103,Micronutrients,14,FALSE)/P103)*O103","v":0},null,null,null,null,null,"None",{"$f":"VLOOKUP(Y103,Micronutrients,14,FALSE)","v":0},{"$f":"VLOOKUP(Y103,Micronutrients,18,FALSE)","v":0},{"$f":"VLOOKUP(Y103,Micronutrients,16,FALSE)","v":1},0,{"$f":"VLOOKUP(Y103,Micronutrients,15,FALSE)","v":0},{"$f":"(AC103*VLOOKUP(Y103,Micronutrients,14,FALSE)/AB103)*AA103","v":0}]
["None",{"$f":"VLOOKUP($A104,Micronutrients,14,FALSE)","v":0},{"$f":"VLOOKUP(A104,Micronutrients,18,FALSE)","v":0},{"$f":"VLOOKUP(A104,Micronutrients,16,FALSE)","v":1},0,{"$f":"VLOOKUP(A104,Micronutrients,15,FALSE)","v":0},{"$f":"(E104*VLOOKUP(A104,Micronutrients,14,FALSE)/D104)*C104","v":0},null,null,null,null,null,"None",{"$f":"VLOOKUP($M104,Micronutrients,14,FALSE)","v":0},{"$f":"VLOOKUP(M104,Micronutrients,18,FALSE)","v":0},{"$f":"VLOOKUP(M104,Micronutrients,16,FALSE)","v":1},0,{"$f":"VLOOKUP(M104,Micronutrients,15,FALSE)","v":0},{"$f":"(Q104*VLOOKUP(M104,Micronutrients,14,FALSE)/P104)*O104","v":0},null,null,null,null,null,"None",{"$f":"VLOOKUP(Y104,Micronutrients,14,FALSE)","v":0},{"$f":"VLOOKUP(Y104,Micronutrients,18,FALSE)","v":0},{"$f":"VLOOKUP(Y104,Micronutrients,16,FALSE)","v":1},0,{"$f":"VLOOKUP(Y104,Micronutrients,15,FALSE)","v":0},{"$f":"(AC104*VLOOKUP(Y104,Micronutrients,14,FALSE)/AB104)*AA104","v":0}]
[]
["Nitrogen Stabilizers (drop down menu)",null,null,null,null,null,null,null,null,null,null,null,"Nitrogen Stabilizers (drop down menu)",null,null,null,null,null,null,null,null,null,null,null,"Nitrogen Stabilizers (drop down menu)"]
["None",{"$f":"VLOOKUP(A107,NitrogenStabilizers,14,FALSE)","v":0},{"$f":"VLOOKUP(A107,NitrogenStabilizers,18,FALSE)","v":0},{"$f":"VLOOKUP(A107,NitrogenStabilizers,16,FALSE)","v":1},0,{"$f":"VLOOKUP(A107,NitrogenStabilizers,15,FALSE)","v":0},{"$f":"(E107*VLOOKUP(A107,NitrogenStabilizers,14,FALSE)/D107)*C107","v":0},null,null,null,null,null,"None",{"$f":"VLOOKUP(M107,NitrogenStabilizers,14,FALSE)","v":0},{"$f":"VLOOKUP(M107,NitrogenStabilizers,18,FALSE)","v":0},{"$f":"VLOOKUP(M107,NitrogenStabilizers,16,FALSE)","v":1},0,{"$f":"VLOOKUP(M107,NitrogenStabilizers,15,FALSE)","v":0},{"$f":"(Q107*VLOOKUP(M107,NitrogenStabilizers,14,FALSE)/P107)*O107","v":0},null,null,null,null,null,"None",{"$f":"VLOOKUP(Y107,NitrogenStabilizers,14,FALSE)","v":0},{"$f":"VLOOKUP(Y107,NitrogenStabilizers,18,FALSE)","v":0},{"$f":"VLOOKUP(Y107,NitrogenStabilizers,16,FALSE)","v":1},0,{"$f":"VLOOKUP(Y107,NitrogenStabilizers,15,FALSE)","v":0},{"$f":"(AC107*VLOOKUP(Y107,NitrogenStabilizers,14,FALSE)/AB107)*AA107","v":0}]
["None",{"$f":"VLOOKUP(A108,NitrogenStabilizers,14,FALSE)","v":0},{"$f":"VLOOKUP(A108,NitrogenStabilizers,18,FALSE)","v":0},{"$f":"VLOOKUP(A108,NitrogenStabilizers,16,FALSE)","v":1},0,{"$f":"VLOOKUP(A108,NitrogenStabilizers,15,FALSE)","v":0},{"$f":"(E108*VLOOKUP(A108,NitrogenStabilizers,14,FALSE)/D108)*C108","v":0},null,null,null,null,null,"None",{"$f":"VLOOKUP(M108,NitrogenStabilizers,14,FALSE)","v":0},{"$f":"VLOOKUP(M108,NitrogenStabilizers,18,FALSE)","v":0},{"$f":"VLOOKUP(M108,NitrogenStabilizers,16,FALSE)","v":1},0,{"$f":"VLOOKUP(M108,NitrogenStabilizers,15,FALSE)","v":0},{"$f":"(Q108*VLOOKUP(M108,NitrogenStabilizers,14,FALSE)/P108)*O108","v":0},null,null,null,null,null,"None",{"$f":"VLOOKUP(Y108,NitrogenStabilizers,14,FALSE)","v":0},{"$f":"VLOOKUP(Y108,NitrogenStabilizers,18,FALSE)","v":0},{"$f":"VLOOKUP(Y108,NitrogenStabilizers,16,FALSE)","v":1},0,{"$f":"VLOOKUP(Y108,NitrogenStabilizers,15,FALSE)","v":0},{"$f":"(AC108*VLOOKUP(Y108,NitrogenStabilizers,14,FALSE)/AB108)*AA108","v":0}]
["5th Application Fertilizer Cost/Acre",null,null,null,null,null,{"$f":"SUM(G93:G108)","v":0},null,null,null,null,null,"5th Application Fertilizer Cost/Acre",null,null,null,null,null,{"$f":"SUM(S93:S108)","v":0},null,null,null,null,null,"5th Application Fertilizer Cost/Acre",null,null,null,null,null,{"$f":"SUM(AE93:AE108)","v":0}]
[]
["Total Fertilizer Cost/Acre",null,null,null,null,null,{"$f":"G109+G88+G25+G67+G46","v":0},null,null,null,null,null,"Total Fertilizer Cost/Acre",null,null,null,null,null,{"$f":"S109+S88+S25+S67+S46","v":0},null,null,null,null,null,"Total Fertilizer Cost/Acre",null,null,null,null,null,{"$f":"AE109+AE88+AE25+AE67+AE46","v":0}]
[]
[null,null,null,null,"Total Nutrient Needs",null,null,null,null,null,null,null,null,null,null,null,"Total Nutrient Needs",null,null,null,null,null,null,null,null,null,null,null,"Total Nutrient Needs"]
[null,null,null,null,"Based on:","Soil Test Based Recs",null,null,"Total Fertilizer Program",null,null,null,null,null,null,null,"Based on:","Soil Test Based Recs",null,null,"Total Fertilizer Program",null,null,null,null,null,null,null,"Based on:","Soil Test Based Recs",null,null,"Total Fertilizer Program"]
["Farm Name",null,null,null,"N","P","K",null,"N","P","K",null,{"$f":"A115","v":"Farm Name"},null,null,null,"N","P","K",null,"N","P","K",null,{"$f":"A115","v":"Farm Name"},null,null,null,"N","P","K",null,"N","P","K"]
["Farm Tract",null,null,null,{"$f":"'Nutrient Management'!B57","v":0},{"$f":"'Nutrient Management'!C57","v":0},{"$f":"'Nutrient Management'!D57","v":0},null,{"$f":"I6+I30+I51+I72+I93","v":0},{"$f":"J6+J30+J51+J72+J93","v":0},0,null,{"$f":"A116","v":"Farm Tract"},null,null,null,{"$f":"'Nutrient Management'!B57","v":0},{"$f":"'Nutrient Management'!C57","v":0},{"$f":"'Nutrient Management'!D57","v":0},null,{"$f":"U6+U30+U51+U72+U93","v":0},{"$f":"V6+V30+V51+V72+V93","v":0},0,null,{"$f":"A116","v":"Farm Tract"},null,null,null,{"$f":"'Nutrient Management'!B57","v":0},{"$f":"'Nutrient Management'!C57","v":0},{"$f":"'Nutrient Management'!D57","v":0},null,{"$f":"AG6+AG30+AG51+AG72+AG93","v":0},{"$f":"AH6+AH30+AH51+AH72+AH93","v":0},0]
["Farm Number",null,null,null,"S","Ca","Mg",null,"S","Ca","Mg",null,"Farm Number",null,null,null,"S","Ca","Mg",null,"S","Ca","Mg",null,"Farm Number",null,null,null,"S","Ca","Mg",null,"S","Ca","Mg"]
[null,null,null,null,{"$f":"'Nutrient Management'!B60","v":0},{"$f":"'Nutrient Management'!C60","v":0},{"$f":"'Nutrient Management'!D60","v":0},null,{"$f":"I9+I33+I54+I75+I96","v":0},{"$f":"J9+J33+J54+J75+J96","v":0},0,null,null,null,null,null,{"$f":"'Nutrient Management'!B60","v":0},{"$f":"'Nutrient Management'!C60","v":0},{"$f":"'Nutrient Management'!D60","v":0},null,{"$f":"U9+U33+U54+U75+U96","v":0},{"$f":"V9+V33+V54+V75+V96","v":0},0,null,null,null,null,null,{"$f":"'Nutrient Management'!B60","v":0},{"$f":"'Nutrient Management'!C60","v":0},{"$f":"'Nutrient Management'!D60","v":0},null,{"$f":"AG9+AG33+AG54+AG75+AG96","v":0},{"$f":"AH9+AH33+AH54+AH75+AH96","v":0},0]
[null,null,null,null,"Zn","B","Mn",null,"Zn","B","Mn",null,null,null,null,null,"Zn","B","Mn",null,"Zn","B","Mn",null,null,null,null,null,"Zn","B","Mn",null,"Zn","B","Mn"]
[null,null,null,null,{"$f":"'Nutrient Management'!B62","v":0},{"$f":"'Nutrient Management'!C62","v":0},{"$f":"'Nutrient Management'!D62","v":0},null,{"$f":"I12+I36+I57+I78+I99","v":0},{"$f":"J12+J36+J57+J78+J99","v":0},0,null,null,null,null,null,{"$f":"'Nutrient Management'!B62","v":0},{"$f":"'Nutrient Management'!C62","v":0},{"$f":"'Nutrient Management'!D62","v":0},null,{"$f":"U12+U36+U57+U78+U99","v":0},{"$f":"V12+V36+V57+V78+V99","v":0},0,null,null,null,null,null,{"$f":"'Nutrient Management'!B62","v":0},{"$f":"'Nutrient Management'!C62","v":0},{"$f":"'Nutrient Management'!D62","v":0},null,{"$f":"AG12+AG36+AG57+AG78+AG99","v":0},{"$f":"AH12+AH36+AH57+AH78+AH99","v":0},0]
[null,null,null,null,"Cu","Mo","Fe",null,"Cu","Mo","Fe",null,null,null,null,null,"Cu","Mo","Fe",null,"Cu","Mo","Fe",null,null,null,null,null,"Cu","Mo","Fe",null,"Cu","Mo","Fe"]
[null,null,null,null,{"$f":"'Nutrient Management'!B64","v":0},{"$f":"'Nutrient Management'!C64","v":0},{"$f":"'Nutrient Management'!D64","v":0},null,{"$f":"I15+I39+I60+I81+I102","v":0},{"$f":"J15+J39+J60+J81+J102","v":0},0,null,null,null,null,null,{"$f":"'Nutrient Management'!B64","v":0},{"$f":"'Nutrient Management'!C64","v":0},{"$f":"'Nutrient Management'!D64","v":0},null,{"$f":"U15+U39+U60+U81+U102","v":0},{"$f":"V15+V39+V60+V81+V102","v":0},0,null,null,null,null,null,{"$f":"'Nutrient Management'!B64","v":0},{"$f":"'Nutrient Management'!C64","v":0},{"$f":"'Nutrient Management'!D64","v":0},null,{"$f":"AG15+AG39+AG60+AG81+AG102","v":0},{"$f":"AH15+AH39+AH60+AH81+AH102","v":0},0]
[null,null,null,null,"* from Nutrient Management tab",null,null,null,null,null,null,null,null,null,null,null,"* from Nutrient Management tab",null,null,null,null,null,null,null,null,null,null,null,"* from Nutrient Management tab"]

{"sheet":"Fertilizer Plan (Alfalfa-Grass)","index":8,"n_rows":123,"n_cols":35,"rows_kept":123,"cut":false,"hidden":false,"merged":[[26,24,26,34],[16,20,21,22],[16,32,21,34],[25,23,68,23],[47,24,47,34],[112,28,112,30],[113,29,113,30],[113,20,113,22],[68,24,68,34],[113,32,113,34],[89,24,89,34],[26,0,26,10],[47,0,47,10],[26,12,26,22],[47,12,47,22],[16,8,21,10],[68,0,68,10],[68,12,68,22],[112,4,112,6],[113,5,113,6],[112,16,112,18],[113,17,113,18],[113,8,113,10],[89,0,89,10],[89,12,89,22],[0,0,0,10],[0,12,0,22],[0,24,0,34],[2,0,2,10],[2,12,2,22],[2,24,2,34],[1,0,1,10],[1,12,1,22],[1,24,1,34]]}
["Alfalfa-Grass Mix",null,null,null,null,null,null,null,null,null,null,null,"Alfalfa-Grass Mix",null,null,null,null,null,null,null,null,null,null,null,"Alfalfa-Grass Mix"]
["Comparison Plan 1",null,null,null,null,null,null,null,null,null,null,null,"Comparison Plan 2",null,null,null,null,null,null,null,null,null,null,null,"Comparison Plan 3"]
["1st Application (i.e., Pre-Plant or Broadcast Fertilizer)",null,null,null,null,null,null,null,null,null,null,null,"1st Application (i.e., Pre-Plant or Broadcast Fertilizer)",null,null,null,null,null,null,null,null,null,null,null,"1st Application (i.e., Pre-Plant or Broadcast Fertilizer)"]
["Fertilizer Source","Purchase Units","Package Price (Gals, Lbs, etc.)","Units/Pkg","Rate/Acre","Units","Cost",null,null,null,null,null,"Fertilizer Source","Purchase Units","Package Price (Gals, Lbs, etc.)","Units/Pkg","Rate/Acre","Units","Cost",null,null,null,null,null,"Fertilizer Source","Purchase Units","Package Price (Gals, Lbs, etc.)","Units/Pkg","Rate/Acre","Units","Cost"]
["Macronutrients (drop down menu)",null,null,null,"(Enter Below)",null,null,null,"N","P","K",null,"Macronutrients (drop down menu)",null,null,null,"(Enter Below)",null,null,null,"N","P","K",null,"Macronutrients (drop down menu)",null,null,null,"(Enter Below)",null,null,null,"N","P","K"]
["None",{"$f":"VLOOKUP(A6,Macronutrients,14,FALSE)","v":0},{"$f":"VLOOKUP(A6,Macronutrients,18,FALSE)","v":0},{"$f":"VLOOKUP(A6,Macronutrients,16,FALSE)","v":1},0,{"$f":"VLOOKUP(A6,Macronutrients,15,FALSE)","v":0},{"$f":"(E6*VLOOKUP(A6,Macronutrients,14,FALSE)/D6)*C6","v":0},null,{"$f":"VLOOKUP(A6,Macronutrients,2,FALSE)*E6+VLOOKUP(A7,Macronutrients,2,FALSE)*E7+VLOOKUP(A8,Macronutrients,2,FALSE)*E8+VLOOKUP(A9,Macronutrients,2,FALSE)*E9+VLOOKUP(A10,Macronutrients,2,FALSE)*E10+VLOOKUP(A11,Macronutrients,2,FALSE)*E11+VLOOKUP(A14,Micronutrients,2,FALSE)*E14+VLOOKUP(A15,Micronutrients,2,FALSE)*E15+VLOOKUP(A16,Micronutrients,2,FALSE)*E16+VLOOKUP(A17,Micronutrients,2,FALSE)*E17","v":0},{"$f":"VLOOKUP(A6,Macronutrients,3,FALSE)*E6+VLOOKUP(A7,Macronutrients,3,FALSE)*E7+VLOOKUP(A8,Macronutrients,3,FALSE)*E8+VLOOKUP(A9,Macronutrients,3,FALSE)*E9+VLOOKUP(A10,Macronutrients,3,FALSE)*E10+VLOOKUP(A11,Macronutrients,3,FALSE)*E11+VLOOKUP(A14,Micronutrients,3,FALSE)*E14+VLOOKUP(A15,Micronutrients,3,FALSE)*E15+VLOOKUP(A16,Micronutrients,3,FALSE)*E16+VLOOKUP(A17,Micronutrients,3,FALSE)*E17","v":0},{"$f":"VLOOKUP(A6,Macronutrients,4,FALSE)*E6+VLOOKUP(A7,Macronutrients,4,FALSE)*E7+VLOOKUP(A8,Macronutrients,4,FALSE)*E8+VLOOKUP(A9,Macronutrients,4,FALSE)*E9+VLOOKUP(A10,Macronutrients,4,FALSE)*E10+VLOOKUP(A11,Macronutrients,4,FALSE)*E11+VLOOKUP(A14,Micronutrients,4,FALSE)*E14+VLOOKUP(A15,Micronutrients,4,FALSE)*E15+VLOOKUP(A16,Micronutrients,4,FALSE)*E16+VLOOKUP(A17,Micronutrients,4,FALSE)*E17","v":0},null,"None",{"$f":"VLOOKUP(M6,Macronutrients,14,FALSE)","v":0},{"$f":"VLOOKUP(M6,Macronutrients,18,FALSE)","v":0},{"$f":"VLOOKUP(M6,Macronutrients,16,FALSE)","v":1},0,{"$f":"VLOOKUP(M6,Macronutrients,15,FALSE)","v":0},{"$f":"(Q6*VLOOKUP(M6,Macronutrients,14,FALSE)/P6)*O6","v":0},null,{"$f":"VLOOKUP(M6,Macronutrients,2,FALSE)*Q6+VLOOKUP(M7,Macronutrients,2,FALSE)*Q7+VLOOKUP(M8,Macronutrients,2,FALSE)*Q8+VLOOKUP(M9,Macronutrients,2,FALSE)*Q9+VLOOKUP(M10,Macronutrients,2,FALSE)*Q10+VLOOKUP(M11,Macronutrients,2,FALSE)*Q11+VLOOKUP(M14,Micronutrients,2,FALSE)*Q14+VLOOKUP(M15,Micronutrients,2,FALSE)*Q15+VLOOKUP(M16,Micronutrients,2,FALSE)*Q16+VLOOKUP(M17,Micronutrients,2,FALSE)*Q17","v":0},{"$f":"VLOOKUP(M6,Macronutrients,3,FALSE)*Q6+VLOOKUP(M7,Macronutrients,3,FALSE)*Q7+VLOOKUP(M8,Macronutrients,3,FALSE)*Q8+VLOOKUP(M9,Macronutrients,3,FALSE)*Q9+VLOOKUP(M10,Macronutrients,3,FALSE)*Q10+VLOOKUP(M11,Macronutrients,3,FALSE)*Q11+VLOOKUP(M14,Micronutrients,3,FALSE)*Q14+VLOOKUP(M15,Micronutrients,3,FALSE)*Q15+VLOOKUP(M16,Micronutrients,3,FALSE)*Q16+VLOOKUP(M17,Micronutrients,3,FALSE)*Q17","v":0},{"$f":"VLOOKUP(M6,Macronutrients,4,FALSE)*Q6+VLOOKUP(M7,Macronutrients,4,FALSE)*Q7+VLOOKUP(M8,Macronutrients,4,FALSE)*Q8+VLOOKUP(M9,Macronutrients,4,FALSE)*Q9+VLOOKUP(M10,Macronutrients,4,FALSE)*Q10+VLOOKUP(M11,Macronutrients,4,FALSE)*Q11+VLOOKUP(M14,Micronutrients,4,FALSE)*Q14+VLOOKUP(M15,Micronutrients,4,FALSE)*Q15+VLOOKUP(M16,Micronutrients,4,FALSE)*Q16+VLOOKUP(M17,Micronutrients,4,FALSE)*Q17","v":0},null,"None",{"$f":"VLOOKUP(Y6,Macronutrients,14,FALSE)","v":0},{"$f":"VLOOKUP(Y6,Macronutrients,18,FALSE)","v":0},{"$f":"VLOOKUP(Y6,Macronutrients,16,FALSE)","v":1},0,{"$f":"VLOOKUP(Y6,Macronutrients,15,FALSE)","v":0},{"$f":"(AC6*VLOOKUP(Y6,Macronutrients,14,FALSE)/AB6)*AA6","v":0},null,{"$f":"VLOOKUP(Y6,Macronutrients,2,FALSE)*AC6+VLOOKUP(Y7,Macronutrients,2,FALSE)*AC7+VLOOKUP(Y8,Macronutrients,2,FALSE)*AC8+VLOOKUP(Y9,Macronutrients,2,FALSE)*AC9+VLOOKUP(Y10,Macronutrients,2,FALSE)*AC10+VLOOKUP(Y11,Macronutrients,2,FALSE)*AC11+VLOOKUP(Y14,Micronutrients,2,FALSE)*AC14+VLOOKUP(Y15,Micronutrients,2,FALSE)*AC15+VLOOKUP(Y16,Micronutrients,2,FALSE)*AC16+VLOOKUP(Y17,Micronutrients,2,FALSE)*AC17","v":0},{"$f":"VLOOKUP(Y6,Macronutrients,3,FALSE)*AC6+VLOOKUP(Y7,Macronutrients,3,FALSE)*AC7+VLOOKUP(Y8,Macronutrients,3,FALSE)*AC8+VLOOKUP(Y9,Macronutrients,3,FALSE)*AC9+VLOOKUP(Y10,Macronutrients,3,FALSE)*AC10+VLOOKUP(Y11,Macronutrients,3,FALSE)*AC11+VLOOKUP(Y14,Micronutrients,3,FALSE)*AC14+VLOOKUP(Y15,Micronutrients,3,FALSE)*AC15+VLOOKUP(Y16,Micronutrients,3,FALSE)*AC16+VLOOKUP(Y17,Micronutrients,3,FALSE)*AC17","v":0},{"$f":"VLOOKUP(Y6,Macronutrients,4,FALSE)*AC6+VLOOKUP(Y7,Macronutrients,4,FALSE)*AC7+VLOOKUP(Y8,Macronutrients,4,FALSE)*AC8+VLOOKUP(Y9,Macronutrients,4,FALSE)*AC9+VLOOKUP(Y10,Macronutrients,4,FALSE)*AC10+VLOOKUP(Y11,Macronutrients,4,FALSE)*AC11+VLOOKUP(Y14,Micronutrients,4,FALSE)*AC14+VLOOKUP(Y15,Micronutrients,4,FALSE)*AC15+VLOOKUP(Y16,Micronutrients,4,FALSE)*AC16+VLOOKUP(Y17,Micronutrients,4,FALSE)*AC17","v":0}]
["None",0,0,1,0,0,0,null,null,null,null,null,"None",0,0,1,0,0,0,null,null,null,null,null,"None",0,0,1,0,0,0]
["None",0,0,1,0,0,0,null,"S","Ca","Mg",null,"None",0,0,1,0,0,0,null,"S","Ca","Mg",null,"None",0,0,1,0,0,0,null,"S","Ca","Mg"]
["None",0,0,1,0,0,0,null,{"$f":"VLOOKUP(A6,Macronutrients,5,FALSE)*E6+VLOOKUP(A7,Macronutrients,5,FALSE)*E7+VLOOKUP(A8,Macronutrients,5,FALSE)*E8+VLOOKUP(A9,Macronutrients,5,FALSE)*E9+VLOOKUP(A10,Macronutrients,5,FALSE)*E10+VLOOKUP(A11,Macronutrients,5,FALSE)*E11+VLOOKUP(A14,Micronutrients,5,FALSE)*E14+VLOOKUP(A15,Micronutrients,5,FALSE)*E15+VLOOKUP(A16,Micronutrients,5,FALSE)*E16+VLOOKUP(A17,Micronutrients,5,FALSE)*E17+VLOOKUP(A20,Lime,5,FALSE)*E20","v":0},{"$f":"VLOOKUP(A6,Macronutrients,7,FALSE)*E6+VLOOKUP(A7,Macronutrients,7,FALSE)*E7+VLOOKUP(A8,Macronutrients,7,FALSE)*E8+VLOOKUP(A9,Macronutrients,7,FALSE)*E9+VLOOKUP(A10,Macronutrients,7,FALSE)*E10+VLOOKUP(A11,Macronutrients,7,FALSE)*E11+VLOOKUP(A14,Micronutrients,7,FALSE)*E14+VLOOKUP(A15,Micronutrients,7,FALSE)*E15+VLOOKUP(A16,Micronutrients,7,FALSE)*E16+VLOOKUP(A17,Micronutrients,7,FALSE)*E17+VLOOKUP(A20,Lime,7,FALSE)*E20","v":0},{"$f":"VLOOKUP($A6,Macronutrients,6,FALSE)*$E$6+VLOOKUP($A7,Macronutrients,6,FALSE)*$E$7+VLOOKUP($A8,Macronutrients,6,FALSE)*$E$8+VLOOKUP($A9,Macronutrients,6,FALSE)*$E$9+VLOOKUP($A10,Macronutrients,6,FALSE)*$E$10+VLOOKUP($A11,Macronutrients,6,FALSE)*$E$11+VLOOKUP($A14,Micronutrients,6,FALSE)*$E$14+VLOOKUP($A15,Micronutrients,6,FALSE)*E15+VLOOKUP($A16,Micronutrients,6,FALSE)*$E$16+VLOOKUP($A17,Micronutrients,6,FALSE)*$E$17+VLOOKUP($A20,Lime,6,FALSE)*E20","v":0},null,"None",0,0,1,0,0,0,null,{"$f":"VLOOKUP(M6,Macronutrients,5,FALSE)*Q6+VLOOKUP(M7,Macronutrients,5,FALSE)*Q7+VLOOKUP(M8,Macronutrients,5,FALSE)*Q8+VLOOKUP(M9,Macronutrients,5,FALSE)*Q9+VLOOKUP(M10,Macronutrients,5,FALSE)*Q10+VLOOKUP(M11,Macronutrients,5,FALSE)*Q11+VLOOKUP(M14,Micronutrients,5,FALSE)*Q14+VLOOKUP(M15,Micronutrients,5,FALSE)*Q15+VLOOKUP(M16,Micronutrients,5,FALSE)*Q16+VLOOKUP(M17,Micronutrients,5,FALSE)*Q17+VLOOKUP(M20,Lime,5,FALSE)*Q20","v":0},{"$f":"VLOOKUP(M6,Macronutrients,7,FALSE)*Q6+VLOOKUP(M7,Macronutrients,7,FALSE)*Q7+VLOOKUP(M8,Macronutrients,7,FALSE)*Q8+VLOOKUP(M9,Macronutrients,7,FALSE)*Q9+VLOOKUP(M10,Macronutrients,7,FALSE)*Q10+VLOOKUP(M11,Macronutrients,7,FALSE)*Q11+VLOOKUP(M14,Micronutrients,7,FALSE)*Q14+VLOOKUP(M15,Micronutrients,7,FALSE)*Q15+VLOOKUP(M16,Micronutrients,7,FALSE)*Q16+VLOOKUP(M17,Micronutrients,7,FALSE)*Q17+VLOOKUP(M20,Lime,7,FALSE)*Q20","v":0},{"$f":"VLOOKUP($A6,Macronutrients,6,FALSE)*$E$6+VLOOKUP($A7,Macronutrients,6,FALSE)*$E$7+VLOOKUP($A8,Macronutrients,6,FALSE)*$E$8+VLOOKUP($A9,Macronutrients,6,FALSE)*$E$9+VLOOKUP($A10,Macronutrients,6,FALSE)*$E$10+VLOOKUP($A11,Macronutrients,6,FALSE)*$E$11+VLOOKUP($A14,Micronutrients,6,FALSE)*$E$14+VLOOKUP($A15,Micronutrients,6,FALSE)*Q15+VLOOKUP($A16,Micronutrients,6,FALSE)*$E$16+VLOOKUP($A17,Micronutrients,6,FALSE)*$E$17+VLOOKUP($A20,Lime,6,FALSE)*Q20","v":0},null,"None",0,0,1,0,0,0,null,{"$f":"VLOOKUP(Y6,Macronutrients,5,FALSE)*AC6+VLOOKUP(Y7,Macronutrients,5,FALSE)*AC7+VLOOKUP(Y8,Macronutrients,5,FALSE)*AC8+VLOOKUP(Y9,Macronutrients,5,FALSE)*AC9+VLOOKUP(Y10,Macronutrients,5,FALSE)*AC10+VLOOKUP(Y11,Macronutrients,5,FALSE)*AC11+VLOOKUP(Y14,Micronutrients,5,FALSE)*AC14+VLOOKUP(Y15,Micronutrients,5,FALSE)*AC15+VLOOKUP(Y16,Micronutrients,5,FALSE)*AC16+VLOOKUP(Y17,Micronutrients,5,FALSE)*AC17+VLOOKUP(Y20,Lime,5,FALSE)*AC20","v":0},{"$f":"VLOOKUP(Y6,Macronutrients,7,FALSE)*AC6+VLOOKUP(Y7,Macronutrients,7,FALSE)*AC7+VLOOKUP(Y8,Macronutrients,7,FALSE)*AC8+VLOOKUP(Y9,Macronutrients,7,FALSE)*AC9+VLOOKUP(Y10,Macronutrients,7,FALSE)*AC10+VLOOKUP(Y11,Macronutrients,7,FALSE)*AC11+VLOOKUP(Y14,Micronutrients,7,FALSE)*AC14+VLOOKUP(Y15,Micronutrients,7,FALSE)*AC15+VLOOKUP(Y16,Micronutrients,7,FALSE)*AC16+VLOOKUP(Y17,Micronutrients,7,FALSE)*AC17+VLOOKUP(Y20,Lime,7,FALSE)*AC20","v":0},{"$f":"VLOOKUP($A6,Macronutrients,6,FALSE)*$E$6+VLOOKUP($A7,Macronutrients,6,FALSE)*$E$7+VLOOKUP($A8,Macronutrients,6,FALSE)*$E$8+VLOOKUP($A9,Macronutrients,6,FALSE)*$E$9+VLOOKUP($A10,Macronutrients,6,FALSE)*$E$10+VLOOKUP($A11,Macronutrients,6,FALSE)*$E$11+VLOOKUP($A14,Micronutrients,6,FALSE)*$E$14+VLOOKUP($A15,Micronutrients,6,FALSE)*AC15+VLOOKUP($A16,Micronutrients,6,FALSE)*$E$16+VLOOKUP($A17,Micronutrients,6,FALSE)*$E$17+VLOOKUP($A20,Lime,6,FALSE)*AC20","v":0}]
["None",0,0,1,0,0,0,null,null,null,null,null,"None",0,0,1,0,0,0,null,null,null,null,null,"None",0,0,1,0,0,0]
["None",0,0,1,0,0,0,null,"Z","B","Mn",null,"None",0,0,1,0,0,0,null,"Z","B","Mn",null,"None",0,0,1,0,0,0,null,"Z","B","Mn"]
[null,null,null,null,null,null,null,null,{"$f":"VLOOKUP(A6,Macronutrients,8,FALSE)*E6+VLOOKUP(A7,Macronutrients,8,FALSE)*E7+VLOOKUP(A8,Macronutrients,8,FALSE)*E8+VLOOKUP(A9,Macronutrients,8,FALSE)*E9+VLOOKUP(A10,Macronutrients,8,FALSE)*E10+VLOOKUP(A11,Macronutrients,8,FALSE)*E11+VLOOKUP(A14,Micronutrients,8,FALSE)*E14+VLOOKUP(A15,Micronutrients,8,FALSE)*E15+VLOOKUP(A16,Micronutrients,8,FALSE)*E16+VLOOKUP(A17,Micronutrients,8,FALSE)*E17+VLOOKUP(A20,Lime,8,FALSE)*E20","v":0},{"$f":"VLOOKUP(A6,Macronutrients,9,FALSE)*E6+VLOOKUP(A7,Macronutrients,9,FALSE)*E7+VLOOKUP(A8,Macronutrients,9,FALSE)*E8+VLOOKUP(A9,Macronutrients,9,FALSE)*E9+VLOOKUP(A10,Macronutrients,9,FALSE)*E10+VLOOKUP(A11,Macronutrients,9,FALSE)*E11+VLOOKUP(A14,Micronutrients,9,FALSE)*E14+VLOOKUP(A15,Micronutrients,9,FALSE)*E15+VLOOKUP(A16,Micronutrients,9,FALSE)*E16+VLOOKUP(A17,Micronutrients,9,FALSE)*E17+VLOOKUP(A20,Lime,9,FALSE)*E20","v":0},{"$f":"VLOOKUP(A6,Macronutrients,10,FALSE)*E6+VLOOKUP(A7,Macronutrients,10,FALSE)*E7+VLOOKUP(A8,Macronutrients,10,FALSE)*E8+VLOOKUP(A9,Macronutrients,10,FALSE)*E9+VLOOKUP(A10,Macronutrients,10,FALSE)*E10+VLOOKUP(A11,Macronutrients,10,FALSE)*E11+VLOOKUP(A14,Micronutrients,10,FALSE)*E14+VLOOKUP(A15,Micronutrients,10,FALSE)*E15+VLOOKUP(A16,Micronutrients,10,FALSE)*E16+VLOOKUP(A17,Micronutrients,10,FALSE)*E17+VLOOKUP(A20,Lime,10,FALSE)*E20","v":0},null,null,null,null,null,null,null,null,null,{"$f":"VLOOKUP(M6,Macronutrients,8,FALSE)*Q6+VLOOKUP(M7,Macronutrients,8,FALSE)*Q7+VLOOKUP(M8,Macronutrients,8,FALSE)*Q8+VLOOKUP(M9,Macronutrients,8,FALSE)*Q9+VLOOKUP(M10,Macronutrients,8,FALSE)*Q10+VLOOKUP(M11,Macronutrients,8,FALSE)*Q11+VLOOKUP(M14,Micronutrients,8,FALSE)*Q14+VLOOKUP(M15,Micronutrients,8,FALSE)*Q15+VLOOKUP(M16,Micronutrients,8,FALSE)*Q16+VLOOKUP(M17,Micronutrients,8,FALSE)*Q17+VLOOKUP(M20,Lime,8,FALSE)*Q20","v":0},{"$f":"VLOOKUP(M6,Macronutrients,9,FALSE)*Q6+VLOOKUP(M7,Macronutrients,9,FALSE)*Q7+VLOOKUP(M8,Macronutrients,9,FALSE)*Q8+VLOOKUP(M9,Macronutrients,9,FALSE)*Q9+VLOOKUP(M10,Macronutrients,9,FALSE)*Q10+VLOOKUP(M11,Macronutrients,9,FALSE)*Q11+VLOOKUP(M14,Micronutrients,9,FALSE)*Q14+VLOOKUP(M15,Micronutrients,9,FALSE)*Q15+VLOOKUP(M16,Micronutrients,9,FALSE)*Q16+VLOOKUP(M17,Micronutrients,9,FALSE)*Q17+VLOOKUP(M20,Lime,9,FALSE)*Q20","v":0},{"$f":"VLOOKUP(M6,Macronutrients,10,FALSE)*Q6+VLOOKUP(M7,Macronutrients,10,FALSE)*Q7+VLOOKUP(M8,Macronutrients,10,FALSE)*Q8+VLOOKUP(M9,Macronutrients,10,FALSE)*Q9+VLOOKUP(M10,Macronutrients,10,FALSE)*Q10+VLOOKUP(M11,Macronutrients,10,FALSE)*Q11+VLOOKUP(M14,Micronutrients,10,FALSE)*Q14+VLOOKUP(M15,Micronutrients,10,FALSE)*Q15+VLOOKUP(M16,Micronutrients,10,FALSE)*Q16+VLOOKUP(M17,Micronutrients,10,FALSE)*Q17+VLOOKUP(M20,Lime,10,FALSE)*Q20","v":0},null,null,null,null,null,null,null,null,null,{"$f":"VLOOKUP(Y6,Macronutrients,8,FALSE)*AC6+VLOOKUP(Y7,Macronutrients,8,FALSE)*AC7+VLOOKUP(Y8,Macronutrients,8,FALSE)*AC8+VLOOKUP(Y9,Macronutrients,8,FALSE)*AC9+VLOOKUP(Y10,Macronutrients,8,FALSE)*AC10+VLOOKUP(Y11,Macronutrients,8,FALSE)*AC11+VLOOKUP(Y14,Micronutrients,8,FALSE)*AC14+VLOOKUP(Y15,Micronutrients,8,FALSE)*AC15+VLOOKUP(Y16,Micronutrients,8,FALSE)*AC16+VLOOKUP(Y17,Micronutrients,8,FALSE)*AC17+VLOOKUP(Y20,Lime,8,FALSE)*AC20","v":0},{"$f":"VLOOKUP(Y6,Macronutrients,9,FALSE)*AC6+VLOOKUP(Y7,Macronutrients,9,FALSE)*AC7+VLOOKUP(Y8,Macronutrients,9,FALSE)*AC8+VLOOKUP(Y9,Macronutrients,9,FALSE)*AC9+VLOOKUP(Y10,Macronutrients,9,FALSE)*AC10+VLOOKUP(Y11,Macronutrients,9,FALSE)*AC11+VLOOKUP(Y14,Micronutrients,9,FALSE)*AC14+VLOOKUP(Y15,Micronutrients,9,FALSE)*AC15+VLOOKUP(Y16,Micronutrients,9,FALSE)*AC16+VLOOKUP(Y17,Micronutrients,9,FALSE)*AC17+VLOOKUP(Y20,Lime,9,FALSE)*AC20","v":0},{"$f":"VLOOKUP(Y6,Macronutrients,10,FALSE)*AC6+VLOOKUP(Y7,Macronutrients,10,FALSE)*AC7+VLOOKUP(Y8,Macronutrients,10,FALSE)*AC8+VLOOKUP(Y9,Macronutrients,10,FALSE)*AC9+VLOOKUP(Y10,Macronutrients,10,FALSE)*AC10+VLOOKUP(Y11,Macronutrients,10,FALSE)*AC11+VLOOKUP(Y14,Micronutrients,10,FALSE)*AC14+VLOOKUP(Y15,Micronutrients,10,FALSE)*AC15+VLOOKUP(Y16,Micronutrients,10,FALSE)*AC16+VLOOKUP(Y17,Micronutrients,10,FALSE)*AC17+VLOOKUP(Y20,Lime,10,FALSE)*AC20","v":0}]
["Micronutrients (drop down menu)",null,null,null,null,null,null,null,null,null,null,null,"Micronutrients (drop down menu)",null,null,null,null,null,null,null,null,null,null,null,"Micronutrients (drop down menu)"]
["None",{"$f":"VLOOKUP($A14,Micronutrients,14,FALSE)","v":0},{"$f":"VLOOKUP(A14,Micronutrients,18,FALSE)","v":0},{"$f":"VLOOKUP(A14,Micronutrients,16,FALSE)","v":1},0,{"$f":"VLOOKUP(A14,Micronutrients,15,FALSE)","v":0},{"$f":"(E14*VLOOKUP(A14,Micronutrients,14,FALSE)/D14)*C14","v":0},null,"Cu","Mo","Fe",null,"None",{"$f":"VLOOKUP(M14,Micronutrients,14,FALSE)","v":0},{"$f":"VLOOKUP(M14,Micronutrients,18,FALSE)","v":0},{"$f":"VLOOKUP(M14,Micronutrients,16,FALSE)","v":1},0,{"$f":"VLOOKUP(M14,Micronutrients,15,FALSE)","v":0},{"$f":"(Q14*VLOOKUP(M14,Micronutrients,14,FALSE)/P14)*O14","v":0},null,"Cu","Mo","Fe",null,"None",{"$f":"VLOOKUP(Y14,Micronutrients,14,FALSE)","v":0},{"$f":"VLOOKUP(Y14,Micronutrients,18,FALSE)","v":0},{"$f":"VLOOKUP(Y14,Micronutrients,16,FALSE)","v":1},0,{"$f":"VLOOKUP(Y14,Micronutrients,15,FALSE)","v":0},{"$f":"(AC14*VLOOKUP(Y14,Micronutrients,14,FALSE)/AB14)*AA14","v":0},null,"Cu","Mo","Fe"]
["None",{"$f":"VLOOKUP($A15,Micronutrients,14,FALSE)","v":0},{"$f":"VLOOKUP(A15,Micronutrients,18,FALSE)","v":0},{"$f":"VLOOKUP(A15,Micronutrients,16,FALSE)","v":1},0,{"$f":"VLOOKUP(A15,Micronutrients,15,FALSE)","v":0},{"$f":"(E15*VLOOKUP(A15,Micronutrients,14,FALSE)/D15)*C15","v":0},null,{"$f":"VLOOKUP(A6,Macronutrients,11,FALSE)*E6+VLOOKUP(A7,Macronutrients,11,FALSE)*E7+VLOOKUP(A8,Macronutrients,11,FALSE)*E8+VLOOKUP(A9,Macronutrients,11,FALSE)*E9+VLOOKUP(A10,Macronutrients,11,FALSE)*E10+VLOOKUP(A11,Macronutrients,11,FALSE)*E11+VLOOKUP(A14,Micronutrients,11,FALSE)*E14+VLOOKUP(A15,Micronutrients,11,FALSE)*E15+VLOOKUP(A16,Micronutrients,11,FALSE)*E16+VLOOKUP(A17,Micronutrients,11,FALSE)*E17+VLOOKUP(A20,Lime,11,FALSE)*E20","v":0},{"$f":"VLOOKUP(A6,Macronutrients,12,FALSE)*E6+VLOOKUP(A7,Macronutrients,12,FALSE)*E7+VLOOKUP(A8,Macronutrients,12,FALSE)*E8+VLOOKUP(A9,Macronutrients,12,FALSE)*E9+VLOOKUP(A10,Macronutrients,12,FALSE)*E10+VLOOKUP(A11,Macronutrients,12,FALSE)*E11+VLOOKUP(A14,Micronutrients,12,FALSE)*E14+VLOOKUP(A15,Micronutrients,12,FALSE)*E15+VLOOKUP(A16,Micronutrients,12,FALSE)*E16+VLOOKUP(A17,Micronutrients,12,FALSE)*E17+VLOOKUP(A20,Lime,12,FALSE)*E20","v":0},{"$f":"VLOOKUP(A6,Macronutrients,13,FALSE)*E6+VLOOKUP(A7,Macronutrients,13,FALSE)*E7+VLOOKUP(A8,Macronutrients,13,FALSE)*E8+VLOOKUP(A9,Macronutrients,13,FALSE)*E9+VLOOKUP(A10,Macronutrients,13,FALSE)*E10+VLOOKUP(A11,Macronutrients,13,FALSE)*E11+VLOOKUP(A14,Micronutrients,13,FALSE)*E14+VLOOKUP(A15,Micronutrients,13,FALSE)*E15+VLOOKUP(A16,Micronutrients,13,FALSE)*E16+VLOOKUP(A17,Micronutrients,13,FALSE)*E17+VLOOKUP(A20,Lime,13,FALSE)*E20","v":0},null,"None",{"$f":"VLOOKUP(M15,Micronutrients,14,FALSE)","v":0},{"$f":"VLOOKUP(M15,Micronutrients,18,FALSE)","v":0},{"$f":"VLOOKUP(M15,Micronutrients,16,FALSE)","v":1},0,{"$f":"VLOOKUP(M15,Micronutrients,15,FALSE)","v":0},{"$f":"(Q15*VLOOKUP(M15,Micronutrients,14,FALSE)/P15)*O15","v":0},null,{"$f":"VLOOKUP(M6,Macronutrients,11,FALSE)*Q6+VLOOKUP(M7,Macronutrients,11,FALSE)*Q7+VLOOKUP(M8,Macronutrients,11,FALSE)*Q8+VLOOKUP(M9,Macronutrients,11,FALSE)*Q9+VLOOKUP(M10,Macronutrients,11,FALSE)*Q10+VLOOKUP(M11,Macronutrients,11,FALSE)*Q11+VLOOKUP(M14,Micronutrients,11,FALSE)*Q14+VLOOKUP(M15,Micronutrients,11,FALSE)*Q15+VLOOKUP(M16,Micronutrients,11,FALSE)*Q16+VLOOKUP(M17,Micronutrients,11,FALSE)*Q17+VLOOKUP(M20,Lime,11,FALSE)*Q20","v":0},{"$f":"VLOOKUP(M6,Macronutrients,12,FALSE)*Q6+VLOOKUP(M7,Macronutrients,12,FALSE)*Q7+VLOOKUP(M8,Macronutrients,12,FALSE)*Q8+VLOOKUP(M9,Macronutrients,12,FALSE)*Q9+VLOOKUP(M10,Macronutrients,12,FALSE)*Q10+VLOOKUP(M11,Macronutrients,12,FALSE)*Q11+VLOOKUP(M14,Micronutrients,12,FALSE)*Q14+VLOOKUP(M15,Micronutrients,12,FALSE)*Q15+VLOOKUP(M16,Micronutrients,12,FALSE)*Q16+VLOOKUP(M17,Micronutrients,12,FALSE)*Q17+VLOOKUP(M20,Lime,12,FALSE)*Q20","v":0},{"$f":"VLOOKUP(M6,Macronutrients,13,FALSE)*Q6+VLOOKUP(M7,Macronutrients,13,FALSE)*Q7+VLOOKUP(M8,Macronutrients,13,FALSE)*Q8+VLOOKUP(M9,Macronutrients,13,FALSE)*Q9+VLOOKUP(M10,Macronutrients,13,FALSE)*Q10+VLOOKUP(M11,Macronutrients,13,FALSE)*Q11+VLOOKUP(M14,Micronutrients,13,FALSE)*Q14+VLOOKUP(M15,Micronutrients,13,FALSE)*Q15+VLOOKUP(M16,Micronutrients,13,FALSE)*Q16+VLOOKUP(M17,Micronutrients,13,FALSE)*Q17+VLOOKUP(M20,Lime,13,FALSE)*Q20","v":0},null,"None",{"$f":"VLOOKUP(Y15,Micronutrients,14,FALSE)","v":0},{"$f":"VLOOKUP(Y15,Micronutrients,18,FALSE)","v":0},{"$f":"VLOOKUP(Y15,Micronutrients,16,FALSE)","v":1},0,{"$f":"VLOOKUP(Y15,Micronutrients,15,FALSE)","v":0},{"$f":"(AC15*VLOOKUP(Y15,Micronutrients,14,FALSE)/AB15)*AA15","v":0},null,{"$f":"VLOOKUP(Y6,Macronutrients,11,FALSE)*AC6+VLOOKUP(Y7,Macronutrients,11,FALSE)*AC7+VLOOKUP(Y8,Macronutrients,11,FALSE)*AC8+VLOOKUP(Y9,Macronutrients,11,FALSE)*AC9+VLOOKUP(Y10,Macronutrients,11,FALSE)*AC10+VLOOKUP(Y11,Macronutrients,11,FALSE)*AC11+VLOOKUP(Y14,Micronutrients,11,FALSE)*AC14+VLOOKUP(Y15,Micronutrients,11,FALSE)*AC15+VLOOKUP(Y16,Micronutrients,11,FALSE)*AC16+VLOOKUP(Y17,Micronutrients,11,FALSE)*AC17+VLOOKUP(Y20,Lime,11,FALSE)*AC20","v":0},{"$f":"VLOOKUP(Y6,Macronutrients,12,FALSE)*AC6+VLOOKUP(Y7,Macronutrients,12,FALSE)*AC7+VLOOKUP(Y8,Macronutrients,12,FALSE)*AC8+VLOOKUP(Y9,Macronutrients,12,FALSE)*AC9+VLOOKUP(Y10,Macronutrients,12,FALSE)*AC10+VLOOKUP(Y11,Macronutrients,12,FALSE)*AC11+VLOOKUP(Y14,Micronutrients,12,FALSE)*AC14+VLOOKUP(Y15,Micronutrients,12,FALSE)*AC15+VLOOKUP(Y16,Micronutrients,12,FALSE)*AC16+VLOOKUP(Y17,Micronutrients,12,FALSE)*AC17+VLOOKUP(Y20,Lime,12,FALSE)*AC20","v":0},{"$f":"VLOOKUP(Y6,Macronutrients,13,FALSE)*AC6+VLOOKUP(Y7,Macronutrients,13,FALSE)*AC7+VLOOKUP(Y8,Macronutrients,13,FALSE)*AC8+VLOOKUP(Y9,Macronutrients,13,FALSE)*AC9+VLOOKUP(Y10,Macronutrients,13,FALSE)*AC10+VLOOKUP(Y11,Macronutrients,13,FALSE)*AC11+VLOOKUP(Y14,Micronutrients,13,FALSE)*AC14+VLOOKUP(Y15,Micronutrients,13,FALSE)*AC15+VLOOKUP(Y16,Micronutrients,13,FALSE)*AC16+VLOOKUP(Y17,Micronutrients,13,FALSE)*AC17+VLOOKUP(Y20,Lime,13,FALSE)*AC20","v":0}]
["None",{"$f":"VLOOKUP($A16,Micronutrients,14,FALSE)","v":0},{"$f":"VLOOKUP(A16,Micronutrients,18,FALSE)","v":0},{"$f":"VLOOKUP(A16,Micronutrients,16,FALSE)","v":1},0,{"$f":"VLOOKUP(A16,Micronutrients,15,FALSE)","v":0},{"$f":"(E16*VLOOKUP(A16,Micronutrients,14,FALSE)/D16)*C16","v":0},null,null,null,null,null,"None",{"$f":"VLOOKUP(M16,Micronutrients,14,FALSE)","v":0},{"$f":"VLOOKUP(M16,Micronutrients,18,FALSE)","v":0},{"$f":"VLOOKUP(M16,Micronutrients,16,FALSE)","v":1},0,{"$f":"VLOOKUP(M16,Micronutrients,15,FALSE)","v":0},{"$f":"(Q16*VLOOKUP(M16,Micronutrients,14,FALSE)/P16)*O16","v":0},null,null,null,null,null,"None",{"$f":"VLOOKUP(Y16,Micronutrients,14,FALSE)","v":0},{"$f":"VLOOKUP(Y16,Micronutrients,18,FALSE)","v":0},{"$f":"VLOOKUP(Y16,Micronutrients,16,FALSE)","v":1},0,{"$f":"'Nutrient Management'!C69","v":0},{"$f":"(AC16*VLOOKUP(Y16,Micronutrients,14,FALSE)/AB16)*AA16","v":0}]
["None",{"$f":"VLOOKUP($A17,Micronutrients,14,FALSE)","v":0},{"$f":"VLOOKUP(A17,Micronutrients,18,FALSE)","v":0},{"$f":"VLOOKUP(A17,Micronutrients,16,FALSE)","v":1},0,{"$f":"VLOOKUP(A17,Micronutrients,15,FALSE)","v":0},{"$f":"(E17*VLOOKUP(A17,Micronutrients,14,FALSE)/D17)*C17","v":0},null,null,null,null,null,"None",{"$f":"VLOOKUP(M17,Micronutrients,14,FALSE)","v":0},{"$f":"VLOOKUP(M17,Micronutrients,18,FALSE)","v":0},{"$f":"VLOOKUP(M17,Micronutrients,16,FALSE)","v":1},0,{"$f":"VLOOKUP(M17,Micronutrients,15,FALSE)","v":0},{"$f":"(Q17*VLOOKUP(M17,Micronutrients,14,FALSE)/P17)*O17","v":0},null,null,null,null,null,"None",{"$f":"VLOOKUP(Y17,Micronutrients,14,FALSE)","v":0},{"$f":"VLOOKUP(Y17,Micronutrients,18,FALSE)","v":0},{"$f":"VLOOKUP(Y17,Micronutrients,16,FALSE)","v":1},0,{"$f":"VLOOKUP(Y17,Micronutrients,15,FALSE)","v":0},{"$f":"(AC17*VLOOKUP(Y17,Micronutrients,14,FALSE)/AB17)*AA17","v":0}]
[]
["Lime (drop down menu)",null,null,null,null,null,null,null,null,null,null,null,"Lime (drop down menu)",null,null,null,null,null,null,null,null,null,null,null,"Lime (drop down menu)"]
["None",{"$f":"VLOOKUP(A20,Lime,14,FALSE)","v":0},{"$f":"VLOOKUP(A20,Lime,18,FALSE)","v":0},{"$f":"VLOOKUP(A20,Lime,16,FALSE)","v":1},0,{"$f":"VLOOKUP(A20,Lime,15,FALSE)","v":0},{"$f":"(E20*VLOOKUP(A20,Lime,14,FALSE)/D20)*C20","v":0},null,null,null,null,null,"None",{"$f":"VLOOKUP(M20,Lime,14,FALSE)","v":0},{"$f":"VLOOKUP(M20,Lime,18,FALSE)","v":0},{"$f":"VLOOKUP(M20,Lime,16,FALSE)","v":1},0,{"$f":"VLOOKUP(M20,Lime,15,FALSE)","v":0},{"$f":"(Q20*VLOOKUP(M20,Lime,14,FALSE)/P20)*O20","v":0},null,null,null,null,null,"None",{"$f":"VLOOKUP(Y20,Lime,14,FALSE)","v":0},{"$f":"VLOOKUP(Y20,Lime,18,FALSE)","v":0},{"$f":"VLOOKUP(Y20,Lime,16,FALSE)","v":1},0,{"$f":"VLOOKUP(Y20,Lime,15,FALSE)","v":0},{"$f":"(AC20*VLOOKUP(Y20,Lime,14,FALSE)/AB20)*AA20","v":0}]
[]
["Nitrogen Stabilizers (drop down menu)",null,null,null,null,null,null,null,null,null,null,null,"Nitrogen Stabilizers (drop down menu)",null,null,null,null,null,null,null,null,null,null,null,"Nitrogen Stabilizers (drop down menu)"]
["None",{"$f":"VLOOKUP(A23,NitrogenStabilizers,14,FALSE)","v":0},{"$f":"VLOOKUP(A23,NitrogenStabilizers,18,FALSE)","v":0},{"$f":"VLOOKUP(A23,NitrogenStabilizers,16,FALSE)","v":1},0,{"$f":"VLOOKUP(A23,NitrogenStabilizers,15,FALSE)","v":0},{"$f":"(E23*VLOOKUP(A23,NitrogenStabilizers,14,FALSE)/D23)*C23","v":0},null,null,null,null,null,"None",{"$f":"VLOOKUP(M23,NitrogenStabilizers,14,FALSE)","v":0},{"$f":"VLOOKUP(M23,NitrogenStabilizers,18,FALSE)","v":0},{"$f":"VLOOKUP(M23,NitrogenStabilizers,16,FALSE)","v":1},0,{"$f":"VLOOKUP(M23,NitrogenStabilizers,15,FALSE)","v":0},{"$f":"(Q23*VLOOKUP(M23,NitrogenStabilizers,14,FALSE)/P23)*O23","v":0},null,null,null,null,null,"None",{"$f":"VLOOKUP(Y23,NitrogenStabilizers,14,FALSE)","v":0},{"$f":"VLOOKUP(Y23,NitrogenStabilizers,18,FALSE)","v":0},{"$f":"VLOOKUP(Y23,NitrogenStabilizers,16,FALSE)","v":1},0,{"$f":"VLOOKUP(Y23,NitrogenStabilizers,15,FALSE)","v":0},{"$f":"(AC23*VLOOKUP(Y23,NitrogenStabilizers,14,FALSE)/AB23)*AA23","v":0}]
["None",{"$f":"VLOOKUP(A24,NitrogenStabilizers,14,FALSE)","v":0},{"$f":"VLOOKUP(A24,NitrogenStabilizers,18,FALSE)","v":0},{"$f":"VLOOKUP(A24,NitrogenStabilizers,16,FALSE)","v":1},0,{"$f":"VLOOKUP(A24,NitrogenStabilizers,15,FALSE)","v":0},{"$f":"(E24*VLOOKUP(A24,NitrogenStabilizers,14,FALSE)/D24)*C24","v":0},null,null,null,null,null,"None",{"$f":"VLOOKUP(M24,NitrogenStabilizers,14,FALSE)","v":0},{"$f":"VLOOKUP(M24,NitrogenStabilizers,18,FALSE)","v":0},{"$f":"VLOOKUP(M24,NitrogenStabilizers,16,FALSE)","v":1},0,{"$f":"VLOOKUP(M24,NitrogenStabilizers,15,FALSE)","v":0},{"$f":"(Q24*VLOOKUP(M24,NitrogenStabilizers,14,FALSE)/P24)*O24","v":0},null,null,null,null,null,"None",{"$f":"VLOOKUP(Y24,NitrogenStabilizers,14,FALSE)","v":0},{"$f":"VLOOKUP(Y24,NitrogenStabilizers,18,FALSE)","v":0},{"$f":"VLOOKUP(Y24,NitrogenStabilizers,16,FALSE)","v":1},0,{"$f":"VLOOKUP(Y24,NitrogenStabilizers,15,FALSE)","v":0},{"$f":"(AC24*VLOOKUP(Y24,NitrogenStabilizers,14,FALSE)/AB24)*AA24","v":0}]
["1st Application Fertilizer Cost/Acre",null,null,null,null,null,{"$f":"SUM(G6:G24)","v":0},null,null,null,null,null,"1st Application Fertilizer Cost/Acre",null,null,null,null,null,{"$f":"SUM(S6:S24)","v":0},null,null,null,null,null,"1st Application Fertilizer Cost/Acre",null,null,null,null,null,{"$f":"SUM(AE6:AE24)","v":0}]
[]
["2nd Application (i.e., Starter Fertilizer or Broadcast)",null,null,null,null,null,null,null,null,null,null,null,"2nd Application (i.e., Starter Fertilizer or Broadcast)",null,null,null,null,null,null,null,null,null,null,null,"2nd Application (i.e., Starter Fertilizer or Broadcast)"]
["Fertilizer Source","Purchase Units","Package Price (Gals, Lbs, etc.)","Units/Pkg","Rate/Acre","Units","Cost",null,null,null,null,null,"Fertilizer Source","Purchase Units","Package Price (Gals, Lbs, etc.)","Units/Pkg","Rate/Acre","Units","Cost",null,null,null,null,null,"Fertilizer Source","Purchase Units","Package Price (Gals, Lbs, etc.)","Units/Pkg","Rate/Acre","Units","Cost"]
["Macronutrients (drop down menu)",null,null,null,"(Enter Below)",null,null,null,"N","P","K",null,"Macronutrients (drop down menu)",null,null,null,"(Enter Below)",null,null,null,"N","P","K",null,"Macronutrients (drop down menu)",null,null,null,"(Enter Below)",null,null,null,"N","P","K"]
["None",{"$f":"VLOOKUP(A30,Macronutrients,14,FALSE)","v":0},{"$f":"VLOOKUP(A30,Macronutrients,18,FALSE)","v":0},{"$f":"VLOOKUP(A30,Macronutrients,16,FALSE)","v":1},0,{"$f":"VLOOKUP(A30,Macronutrients,15,FALSE)","v":0},{"$f":"(E30*VLOOKUP(A30,Macronutrients,14,FALSE)/D30)*C30","v":0},null,{"$f":"VLOOKUP(A30,Macronutrients,2,FALSE)*E30+VLOOKUP(A31,Macronutrients,2,FALSE)*E31+VLOOKUP(A32,Macronutrients,2,FALSE)*E32+VLOOKUP(A33,Macronutrients,2,FALSE)*E33+VLOOKUP(A34,Macronutrients,2,FALSE)*E34+VLOOKUP(A35,Macronutrients,2,FALSE)*E35+VLOOKUP(A38,Micronutrients,2,FALSE)*E38+VLOOKUP(A39,Micronutrients,2,FALSE)*E39+VLOOKUP(A40,Micronutrients,2,FALSE)*E40+VLOOKUP(A41,Micronutrients,2,FALSE)*E41","v":0},{"$f":"VLOOKUP(A30,Macronutrients,3,FALSE)*E30+VLOOKUP(A31,Macronutrients,3,FALSE)*E31+VLOOKUP(A32,Macronutrients,3,FALSE)*E32+VLOOKUP(A33,Macronutrients,3,FALSE)*E33+VLOOKUP(A34,Macronutrients,3,FALSE)*E34+VLOOKUP(A35,Macronutrients,3,FALSE)*E35+VLOOKUP(A38,Micronutrients,3,FALSE)*E38+VLOOKUP(A39,Micronutrients,3,FALSE)*E39+VLOOKUP(A40,Micronutrients,3,FALSE)*E40+VLOOKUP(A41,Micronutrients,3,FALSE)*E41","v":0},{"$f":"VLOOKUP(A30,Macronutrients,4,FALSE)*E30+VLOOKUP(A31,Macronutrients,4,FALSE)*E31+VLOOKUP(A32,Macronutrients,4,FALSE)*E32+VLOOKUP(A33,Macronutrients,4,FALSE)*E33+VLOOKUP(A34,Macronutrients,4,FALSE)*E34+VLOOKUP(A35,Macronutrients,4,FALSE)*E35+VLOOKUP(A38,Micronutrients,4,FALSE)*E38+VLOOKUP(A39,Micronutrients,4,FALSE)*E39+VLOOKUP(A40,Micronutrients,4,FALSE)*E40+VLOOKUP(A41,Micronutrients,4,FALSE)*E41","v":0},null,"None",{"$f":"VLOOKUP(M30,Macronutrients,14,FALSE)","v":0},{"$f":"VLOOKUP(M30,Macronutrients,18,FALSE)","v":0},{"$f":"VLOOKUP(M30,Macronutrients,16,FALSE)","v":1},0,{"$f":"VLOOKUP(M30,Macronutrients,15,FALSE)","v":0},{"$f":"(Q30*VLOOKUP(M30,Macronutrients,14,FALSE)/P30)*O30","v":0},null,{"$f":"VLOOKUP(M30,Macronutrients,2,FALSE)*Q30+VLOOKUP(M31,Macronutrients,2,FALSE)*Q31+VLOOKUP(M32,Macronutrients,2,FALSE)*Q32+VLOOKUP(M33,Macronutrients,2,FALSE)*Q33+VLOOKUP(M34,Macronutrients,2,FALSE)*Q34+VLOOKUP(M35,Macronutrients,2,FALSE)*Q35+VLOOKUP(M38,Micronutrients,2,FALSE)*Q38+VLOOKUP(M39,Micronutrients,2,FALSE)*Q39+VLOOKUP(M40,Micronutrients,2,FALSE)*Q40+VLOOKUP(M41,Micronutrients,2,FALSE)*Q41","v":0},{"$f":"VLOOKUP(M30,Macronutrients,3,FALSE)*Q30+VLOOKUP(M31,Macronutrients,3,FALSE)*Q31+VLOOKUP(M32,Macronutrients,3,FALSE)*Q32+VLOOKUP(M33,Macronutrients,3,FALSE)*Q33+VLOOKUP(M34,Macronutrients,3,FALSE)*Q34+VLOOKUP(M35,Macronutrients,3,FALSE)*Q35+VLOOKUP(M38,Micronutrients,3,FALSE)*Q38+VLOOKUP(M39,Micronutrients,3,FALSE)*Q39+VLOOKUP(M40,Micronutrients,3,FALSE)*Q40+VLOOKUP(M41,Micronutrients,3,FALSE)*Q41","v":0},{"$f":"VLOOKUP(M30,Macronutrients,4,FALSE)*Q30+VLOOKUP(M31,Macronutrients,4,FALSE)*Q31+VLOOKUP(M32,Macronutrients,4,FALSE)*Q32+VLOOKUP(M33,Macronutrients,4,FALSE)*Q33+VLOOKUP(M34,Macronutrients,4,FALSE)*Q34+VLOOKUP(M35,Macronutrients,4,FALSE)*Q35+VLOOKUP(M38,Micronutrients,4,FALSE)*Q38+VLOOKUP(M39,Micronutrients,4,FALSE)*Q39+VLOOKUP(M40,Micronutrients,4,FALSE)*Q40+VLOOKUP(M41,Micronutrients,4,FALSE)*Q41","v":0},null,"None",{"$f":"VLOOKUP(Y30,Macronutrients,14,FALSE)","v":0},{"$f":"VLOOKUP(Y30,Macronutrients,18,FALSE)","v":0},{"$f":"VLOOKUP(Y30,Macronutrients,16,FALSE)","v":1},0,{"$f":"VLOOKUP(Y30,Macronutrients,15,FALSE)","v":0},{"$f":"(AC30*VLOOKUP(Y30,Macronutrients,14,FALSE)/AB30)*AA30","v":0},null,{"$f":"VLOOKUP(Y30,Macronutrients,2,FALSE)*AC30+VLOOKUP(Y31,Macronutrients,2,FALSE)*AC31+VLOOKUP(Y32,Macronutrients,2,FALSE)*AC32+VLOOKUP(Y33,Macronutrients,2,FALSE)*AC33+VLOOKUP(Y34,Macronutrients,2,FALSE)*AC34+VLOOKUP(Y35,Macronutrients,2,FALSE)*AC35+VLOOKUP(Y38,Micronutrients,2,FALSE)*AC38+VLOOKUP(Y39,Micronutrients,2,FALSE)*AC39+VLOOKUP(Y40,Micronutrients,2,FALSE)*AC40+VLOOKUP(Y41,Micronutrients,2,FALSE)*AC41","v":0},{"$f":"VLOOKUP(Y30,Macronutrients,3,FALSE)*AC30+VLOOKUP(Y31,Macronutrients,3,FALSE)*AC31+VLOOKUP(Y32,Macronutrients,3,FALSE)*AC32+VLOOKUP(Y33,Macronutrients,3,FALSE)*AC33+VLOOKUP(Y34,Macronutrients,3,FALSE)*AC34+VLOOKUP(Y35,Macronutrients,3,FALSE)*AC35+VLOOKUP(Y38,Micronutrients,3,FALSE)*AC38+VLOOKUP(Y39,Micronutrients,3,FALSE)*AC39+VLOOKUP(Y40,Micronutrients,3,FALSE)*AC40+VLOOKUP(Y41,Micronutrients,3,FALSE)*AC41","v":0},{"$f":"VLOOKUP(Y30,Macronutrients,4,FALSE)*AC30+VLOOKUP(Y31,Macronutrients,4,FALSE)*AC31+VLOOKUP(Y32,Macronutrients,4,FALSE)*AC32+VLOOKUP(Y33,Macronutrients,4,FALSE)*AC33+VLOOKUP(Y34,Macronutrients,4,FALSE)*AC34+VLOOKUP(Y35,Macronutrients,4,FALSE)*AC35+VLOOKUP(Y38,Micronutrients,4,FALSE)*AC38+VLOOKUP(Y39,Micronutrients,4,FALSE)*AC39+VLOOKUP(Y40,Micronutrients,4,FALSE)*AC40+VLOOKUP(Y41,Micronutrients,4,FALSE)*AC41","v":0}]
["None",0,0,1,0,0,0,null,null,null,null,null,"None",0,0,1,0,0,0,null,null,null,null,null,"None",0,0,1,0,0,0]
["None",0,0,1,0,0,0,null,"S","Ca","Mg",null,"None",0,0,1,0,0,0,null,"S","Ca","Mg",null,"None",0,0,1,0,0,0,null,"S","Ca","Mg"]
["None",0,0,1,0,0,0,null,{"$f":"VLOOKUP(A30,Macronutrients,5,FALSE)*E30+VLOOKUP(A31,Macronutrients,5,FALSE)*E31+VLOOKUP(A32,Macronutrients,5,FALSE)*E32+VLOOKUP(A33,Macronutrients,5,FALSE)*E33+VLOOKUP(A34,Macronutrients,5,FALSE)*E34+VLOOKUP(A35,Macronutrients,5,FALSE)*E35+VLOOKUP(A38,Micronutrients,5,FALSE)*E38+VLOOKUP(A39,Micronutrients,5,FALSE)*E39+VLOOKUP(A40,Micronutrients,5,FALSE)*E40+VLOOKUP(A41,Micronutrients,5,FALSE)*E41","v":0},{"$f":"VLOOKUP(A30,Macronutrients,7,FALSE)*E30+VLOOKUP(A31,Macronutrients,7,FALSE)*E31+VLOOKUP(A32,Macronutrients,7,FALSE)*E32+VLOOKUP(A33,Macronutrients,7,FALSE)*E33+VLOOKUP(A34,Macronutrients,7,FALSE)*E34+VLOOKUP(A35,Macronutrients,7,FALSE)*E35+VLOOKUP(A38,Micronutrients,7,FALSE)*E38+VLOOKUP(A39,Micronutrients,7,FALSE)*E39+VLOOKUP(A40,Micronutrients,7,FALSE)*E40+VLOOKUP(A41,Micronutrients,7,FALSE)*E41","v":0},{"$f":"VLOOKUP($A30,Macronutrients,6,FALSE)*$E$6+VLOOKUP($A31,Macronutrients,6,FALSE)*$E$7+VLOOKUP($A32,Macronutrients,6,FALSE)*$E$8+VLOOKUP($A33,Macronutrients,6,FALSE)*$E$9+VLOOKUP($A34,Macronutrients,6,FALSE)*$E$10+VLOOKUP($A35,Macronutrients,6,FALSE)*$E$11+VLOOKUP($A38,Micronutrients,6,FALSE)*$E$14+VLOOKUP($A39,Micronutrients,6,FALSE)*E39+VLOOKUP($A40,Micronutrients,6,FALSE)*$E$16+VLOOKUP($A41,Micronutrients,6,FALSE)*$E$17","v":0},null,"None",0,0,1,0,0,0,null,{"$f":"VLOOKUP(M30,Macronutrients,5,FALSE)*Q30+VLOOKUP(M31,Macronutrients,5,FALSE)*Q31+VLOOKUP(M32,Macronutrients,5,FALSE)*Q32+VLOOKUP(M33,Macronutrients,5,FALSE)*Q33+VLOOKUP(M34,Macronutrients,5,FALSE)*Q34+VLOOKUP(M35,Macronutrients,5,FALSE)*Q35+VLOOKUP(M38,Micronutrients,5,FALSE)*Q38+VLOOKUP(M39,Micronutrients,5,FALSE)*Q39+VLOOKUP(M40,Micronutrients,5,FALSE)*Q40+VLOOKUP(M41,Micronutrients,5,FALSE)*Q41","v":0},{"$f":"VLOOKUP(M30,Macronutrients,7,FALSE)*Q30+VLOOKUP(M31,Macronutrients,7,FALSE)*Q31+VLOOKUP(M32,Macronutrients,7,FALSE)*Q32+VLOOKUP(M33,Macronutrients,7,FALSE)*Q33+VLOOKUP(M34,Macronutrients,7,FALSE)*Q34+VLOOKUP(M35,Macronutrients,7,FALSE)*Q35+VLOOKUP(M38,Micronutrients,7,FALSE)*Q38+VLOOKUP(M39,Micronutrients,7,FALSE)*Q39+VLOOKUP(M40,Micronutrients,7,FALSE)*Q40+VLOOKUP(M41,Micronutrients,7,FALSE)*Q41","v":0},{"$f":"VLOOKUP($A30,Macronutrients,6,FALSE)*$E$6+VLOOKUP($A31,Macronutrients,6,FALSE)*$E$7+VLOOKUP($A32,Macronutrients,6,FALSE)*$E$8+VLOOKUP($A33,Macronutrients,6,FALSE)*$E$9+VLOOKUP($A34,Macronutrients,6,FALSE)*$E$10+VLOOKUP($A35,Macronutrients,6,FALSE)*$E$11+VLOOKUP($A38,Micronutrients,6,FALSE)*$E$14+VLOOKUP($A39,Micronutrients,6,FALSE)*Q39+VLOOKUP($A40,Micronutrients,6,FALSE)*$E$16+VLOOKUP($A41,Micronutrients,6,FALSE)*$E$17","v":0},null,"None",0,0,1,0,0,0,null,{"$f":"VLOOKUP(Y30,Macronutrients,5,FALSE)*AC30+VLOOKUP(Y31,Macronutrients,5,FALSE)*AC31+VLOOKUP(Y32,Macronutrients,5,FALSE)*AC32+VLOOKUP(Y33,Macronutrients,5,FALSE)*AC33+VLOOKUP(Y34,Macronutrients,5,FALSE)*AC34+VLOOKUP(Y35,Macronutrients,5,FALSE)*AC35+VLOOKUP(Y38,Micronutrients,5,FALSE)*AC38+VLOOKUP(Y39,Micronutrients,5,FALSE)*AC39+VLOOKUP(Y40,Micronutrients,5,FALSE)*AC40+VLOOKUP(Y41,Micronutrients,5,FALSE)*AC41","v":0},{"$f":"VLOOKUP(Y30,Macronutrients,7,FALSE)*AC30+VLOOKUP(Y31,Macronutrients,7,FALSE)*AC31+VLOOKUP(Y32,Macronutrients,7,FALSE)*AC32+VLOOKUP(Y33,Macronutrients,7,FALSE)*AC33+VLOOKUP(Y34,Macronutrients,7,FALSE)*AC34+VLOOKUP(Y35,Macronutrients,7,FALSE)*AC35+VLOOKUP(Y38,Micronutrients,7,FALSE)*AC38+VLOOKUP(Y39,Micronutrients,7,FALSE)*AC39+VLOOKUP(Y40,Micronutrients,7,FALSE)*AC40+VLOOKUP(Y41,Micronutrients,7,FALSE)*AC41","v":0},{"$f":"VLOOKUP($A30,Macronutrients,6,FALSE)*$E$6+VLOOKUP($A31,Macronutrients,6,FALSE)*$E$7+VLOOKUP($A32,Macronutrients,6,FALSE)*$E$8+VLOOKUP($A33,Macronutrients,6,FALSE)*$E$9+VLOOKUP($A34,Macronutrients,6,FALSE)*$E$10+VLOOKUP($A35,Macronutrients,6,FALSE)*$E$11+VLOOKUP($A38,Micronutrients,6,FALSE)*$E$14+VLOOKUP($A39,Micronutrients,6,FALSE)*AC39+VLOOKUP($A40,Micronutrients,6,FALSE)*$E$16+VLOOKUP($A41,Micronutrients,6,FALSE)*$E$17","v":0}]
["None",0,0,1,0,0,0,null,null,null,null,null,"None",0,0,1,0,0,0,null,null,null,null,null,"None",0,0,1,0,0,0]
["None",0,0,1,0,0,0,null,"Z","B","Mn",null,"None",0,0,1,0,0,0,null,"Z","B","Mn",null,"None",0,0,1,0,0,0,null,"Z","B","Mn"]
[null,null,null,null,null,null,null,null,{"$f":"VLOOKUP(A30,Macronutrients,8,FALSE)*E30+VLOOKUP(A31,Macronutrients,8,FALSE)*E31+VLOOKUP(A32,Macronutrients,8,FALSE)*E32+VLOOKUP(A33,Macronutrients,8,FALSE)*E33+VLOOKUP(A34,Macronutrients,8,FALSE)*E34+VLOOKUP(A35,Macronutrients,8,FALSE)*E35+VLOOKUP(A38,Micronutrients,8,FALSE)*E38+VLOOKUP(A39,Micronutrients,8,FALSE)*E39+VLOOKUP(A40,Micronutrients,8,FALSE)*E40+VLOOKUP(A41,Micronutrients,8,FALSE)*E41","v":0},{"$f":"VLOOKUP(A30,Macronutrients,9,FALSE)*E30+VLOOKUP(A31,Macronutrients,9,FALSE)*E31+VLOOKUP(A32,Macronutrients,9,FALSE)*E32+VLOOKUP(A33,Macronutrients,9,FALSE)*E33+VLOOKUP(A34,Macronutrients,9,FALSE)*E34+VLOOKUP(A35,Macronutrients,9,FALSE)*E35+VLOOKUP(A38,Micronutrients,9,FALSE)*E38+VLOOKUP(A39,Micronutrients,9,FALSE)*E39+VLOOKUP(A40,Micronutrients,9,FALSE)*E40+VLOOKUP(A41,Micronutrients,9,FALSE)*E41","v":0},{"$f":"VLOOKUP(A30,Macronutrients,10,FALSE)*E30+VLOOKUP(A31,Macronutrients,10,FALSE)*E31+VLOOKUP(A32,Macronutrients,10,FALSE)*E32+VLOOKUP(A33,Macronutrients,10,FALSE)*E33+VLOOKUP(A34,Macronutrients,10,FALSE)*E34+VLOOKUP(A35,Macronutrients,10,FALSE)*E35+VLOOKUP(A38,Micronutrients,10,FALSE)*E38+VLOOKUP(A39,Micronutrients,10,FALSE)*E39+VLOOKUP(A40,Micronutrients,10,FALSE)*E40+VLOOKUP(A41,Micronutrients,10,FALSE)*E41","v":0},null,null,null,null,null,null,null,null,null,{"$f":"VLOOKUP(M30,Macronutrients,8,FALSE)*Q30+VLOOKUP(M31,Macronutrients,8,FALSE)*Q31+VLOOKUP(M32,Macronutrients,8,FALSE)*Q32+VLOOKUP(M33,Macronutrients,8,FALSE)*Q33+VLOOKUP(M34,Macronutrients,8,FALSE)*Q34+VLOOKUP(M35,Macronutrients,8,FALSE)*Q35+VLOOKUP(M38,Micronutrients,8,FALSE)*Q38+VLOOKUP(M39,Micronutrients,8,FALSE)*Q39+VLOOKUP(M40,Micronutrients,8,FALSE)*Q40+VLOOKUP(M41,Micronutrients,8,FALSE)*Q41","v":0},{"$f":"VLOOKUP(M30,Macronutrients,9,FALSE)*Q30+VLOOKUP(M31,Macronutrients,9,FALSE)*Q31+VLOOKUP(M32,Macronutrients,9,FALSE)*Q32+VLOOKUP(M33,Macronutrients,9,FALSE)*Q33+VLOOKUP(M34,Macronutrients,9,FALSE)*Q34+VLOOKUP(M35,Macronutrients,9,FALSE)*Q35+VLOOKUP(M38,Micronutrients,9,FALSE)*Q38+VLOOKUP(M39,Micronutrients,9,FALSE)*Q39+VLOOKUP(M40,Micronutrients,9,FALSE)*Q40+VLOOKUP(M41,Micronutrients,9,FALSE)*Q41","v":0},{"$f":"VLOOKUP(M30,Macronutrients,10,FALSE)*Q30+VLOOKUP(M31,Macronutrients,10,FALSE)*Q31+VLOOKUP(M32,Macronutrients,10,FALSE)*Q32+VLOOKUP(M33,Macronutrients,10,FALSE)*Q33+VLOOKUP(M34,Macronutrients,10,FALSE)*Q34+VLOOKUP(M35,Macronutrients,10,FALSE)*Q35+VLOOKUP(M38,Micronutrients,10,FALSE)*Q38+VLOOKUP(M39,Micronutrients,10,FALSE)*Q39+VLOOKUP(M40,Micronutrients,10,FALSE)*Q40+VLOOKUP(M41,Micronutrients,10,FALSE)*Q41","v":0},null,null,null,null,null,null,null,null,null,{"$f":"VLOOKUP(Y30,Macronutrients,8,FALSE)*AC30+VLOOKUP(Y31,Macronutrients,8,FALSE)*AC31+VLOOKUP(Y32,Macronutrients,8,FALSE)*AC32+VLOOKUP(Y33,Macronutrients,8,FALSE)*AC33+VLOOKUP(Y34,Macronutrients,8,FALSE)*AC34+VLOOKUP(Y35,Macronutrients,8,FALSE)*AC35+VLOOKUP(Y38,Micronutrients,8,FALSE)*AC38+VLOOKUP(Y39,Micronutrients,8,FALSE)*AC39+VLOOKUP(Y40,Micronutrients,8,FALSE)*AC40+VLOOKUP(Y41,Micronutrients,8,FALSE)*AC41","v":0},{"$f":"VLOOKUP(Y30,Macronutrients,9,FALSE)*AC30+VLOOKUP(Y31,Macronutrients,9,FALSE)*AC31+VLOOKUP(Y32,Macronutrients,9,FALSE)*AC32+VLOOKUP(Y33,Macronutrients,9,FALSE)*AC33+VLOOKUP(Y34,Macronutrients,9,FALSE)*AC34+VLOOKUP(Y35,Macronutrients,9,FALSE)*AC35+VLOOKUP(Y38,Micronutrients,9,FALSE)*AC38+VLOOKUP(Y39,Micronutrients,9,FALSE)*AC39+VLOOKUP(Y40,Micronutrients,9,FALSE)*AC40+VLOOKUP(Y41,Micronutrients,9,FALSE)*AC41","v":0},{"$f":"VLOOKUP(Y30,Macronutrients,10,FALSE)*AC30+VLOOKUP(Y31,Macronutrients,10,FALSE)*AC31+VLOOKUP(Y32,Macronutrients,10,FALSE)*AC32+VLOOKUP(Y33,Macronutrients,10,FALSE)*AC33+VLOOKUP(Y34,Macronutrients,10,FALSE)*AC34+VLOOKUP(Y35,Macronutrients,10,FALSE)*AC35+VLOOKUP(Y38,Micronutrients,10,FALSE)*AC38+VLOOKUP(Y39,Micronutrients,10,FALSE)*AC39+VLOOKUP(Y40,Micronutrients,10,FALSE)*AC40+VLOOKUP(Y41,Micronutrients,10,FALSE)*AC41","v":0}]
["Micronutrients (drop down menu)",null,null,null,null,null,null,null,null,null,null,null,"Micronutrients (drop down menu)",null,null,null,null,null,null,null,null,null,null,null,"Micronutrients (drop down menu)"]
["None",{"$f":"VLOOKUP($A38,Micronutrients,14,FALSE)","v":0},{"$f":"VLOOKUP(A38,Micronutrients,18,FALSE)","v":0},{"$f":"VLOOKUP(A38,Micronutrients,16,FALSE)","v":1},0,{"$f":"VLOOKUP(A38,Micronutrients,15,FALSE)","v":0},{"$f":"(E38*VLOOKUP(A38,Micronutrients,14,FALSE)/D38)*C38","v":0},null,"Cu","Mo","Fe",null,"None",{"$f":"VLOOKUP($M38,Micronutrients,14,FALSE)","v":0},{"$f":"VLOOKUP(M38,Micronutrients,18,FALSE)","v":0},{"$f":"VLOOKUP(M38,Micronutrients,16,FALSE)","v":1},0,{"$f":"VLOOKUP(M38,Micronutrients,15,FALSE)","v":0},{"$f":"(Q38*VLOOKUP(M38,Micronutrients,14,FALSE)/P38)*O38","v":0},null,"Cu","Mo","Fe",null,"None",{"$f":"VLOOKUP(Y38,Micronutrients,14,FALSE)","v":0},{"$f":"VLOOKUP(Y38,Micronutrients,18,FALSE)","v":0},{"$f":"VLOOKUP(Y38,Micronutrients,16,FALSE)","v":1},0,{"$f":"VLOOKUP(Y38,Micronutrients,15,FALSE)","v":0},{"$f":"(AC38*VLOOKUP(Y38,Micronutrients,14,FALSE)/AB38)*AA38","v":0},null,"Cu","Mo","Fe"]
["None",{"$f":"VLOOKUP($A39,Micronutrients,14,FALSE)","v":0},{"$f":"VLOOKUP(A39,Micronutrients,18,FALSE)","v":0},{"$f":"VLOOKUP(A39,Micronutrients,16,FALSE)","v":1},0,{"$f":"VLOOKUP(A39,Micronutrients,15,FALSE)","v":0},{"$f":"(E39*VLOOKUP(A39,Micronutrients,14,FALSE)/D39)*C39","v":0},null,{"$f":"VLOOKUP(A30,Macronutrients,11,FALSE)*E30+VLOOKUP(A31,Macronutrients,11,FALSE)*E31+VLOOKUP(A32,Macronutrients,11,FALSE)*E32+VLOOKUP(A33,Macronutrients,11,FALSE)*E33+VLOOKUP(A34,Macronutrients,11,FALSE)*E34+VLOOKUP(A35,Macronutrients,11,FALSE)*E35+VLOOKUP(A38,Micronutrients,11,FALSE)*E38+VLOOKUP(A39,Micronutrients,11,FALSE)*E39+VLOOKUP(A40,Micronutrients,11,FALSE)*E40+VLOOKUP(A41,Micronutrients,11,FALSE)*E41","v":0},{"$f":"VLOOKUP(A30,Macronutrients,12,FALSE)*E30+VLOOKUP(A31,Macronutrients,12,FALSE)*E31+VLOOKUP(A32,Macronutrients,12,FALSE)*E32+VLOOKUP(A33,Macronutrients,12,FALSE)*E33+VLOOKUP(A34,Macronutrients,12,FALSE)*E34+VLOOKUP(A35,Macronutrients,12,FALSE)*E35+VLOOKUP(A38,Micronutrients,12,FALSE)*E38+VLOOKUP(A39,Micronutrients,12,FALSE)*E39+VLOOKUP(A40,Micronutrients,12,FALSE)*E40+VLOOKUP(A41,Micronutrients,12,FALSE)*E41","v":0},{"$f":"VLOOKUP(A30,Macronutrients,13,FALSE)*E30+VLOOKUP(A31,Macronutrients,13,FALSE)*E31+VLOOKUP(A32,Macronutrients,13,FALSE)*E32+VLOOKUP(A33,Macronutrients,13,FALSE)*E33+VLOOKUP(A34,Macronutrients,13,FALSE)*E34+VLOOKUP(A35,Macronutrients,13,FALSE)*E35+VLOOKUP(A38,Micronutrients,13,FALSE)*E38+VLOOKUP(A39,Micronutrients,13,FALSE)*E39+VLOOKUP(A40,Micronutrients,13,FALSE)*E40+VLOOKUP(A41,Micronutrients,13,FALSE)*E41","v":0},null,"None",{"$f":"VLOOKUP($M39,Micronutrients,14,FALSE)","v":0},{"$f":"VLOOKUP(M39,Micronutrients,18,FALSE)","v":0},{"$f":"VLOOKUP(M39,Micronutrients,16,FALSE)","v":1},0,{"$f":"VLOOKUP(M39,Micronutrients,15,FALSE)","v":0},{"$f":"(Q39*VLOOKUP(M39,Micronutrients,14,FALSE)/P39)*O39","v":0},null,{"$f":"VLOOKUP(M30,Macronutrients,11,FALSE)*Q30+VLOOKUP(M31,Macronutrients,11,FALSE)*Q31+VLOOKUP(M32,Macronutrients,11,FALSE)*Q32+VLOOKUP(M33,Macronutrients,11,FALSE)*Q33+VLOOKUP(M34,Macronutrients,11,FALSE)*Q34+VLOOKUP(M35,Macronutrients,11,FALSE)*Q35+VLOOKUP(M38,Micronutrients,11,FALSE)*Q38+VLOOKUP(M39,Micronutrients,11,FALSE)*Q39+VLOOKUP(M40,Micronutrients,11,FALSE)*Q40+VLOOKUP(M41,Micronutrients,11,FALSE)*Q41","v":0},{"$f":"VLOOKUP(M30,Macronutrients,12,FALSE)*Q30+VLOOKUP(M31,Macronutrients,12,FALSE)*Q31+VLOOKUP(M32,Macronutrients,12,FALSE)*Q32+VLOOKUP(M33,Macronutrients,12,FALSE)*Q33+VLOOKUP(M34,Macronutrients,12,FALSE)*Q34+VLOOKUP(M35,Macronutrients,12,FALSE)*Q35+VLOOKUP(M38,Micronutrients,12,FALSE)*Q38+VLOOKUP(M39,Micronutrients,12,FALSE)*Q39+VLOOKUP(M40,Micronutrients,12,FALSE)*Q40+VLOOKUP(M41,Micronutrients,12,FALSE)*Q41","v":0},{"$f":"VLOOKUP(M30,Macronutrients,13,FALSE)*Q30+VLOOKUP(M31,Macronutrients,13,FALSE)*Q31+VLOOKUP(M32,Macronutrients,13,FALSE)*Q32+VLOOKUP(M33,Macronutrients,13,FALSE)*Q33+VLOOKUP(M34,Macronutrients,13,FALSE)*Q34+VLOOKUP(M35,Macronutrients,13,FALSE)*Q35+VLOOKUP(M38,Micronutrients,13,FALSE)*Q38+VLOOKUP(M39,Micronutrients,13,FALSE)*Q39+VLOOKUP(M40,Micronutrients,13,FALSE)*Q40+VLOOKUP(M41,Micronutrients,13,FALSE)*Q41","v":0},null,"None",{"$f":"VLOOKUP(Y39,Micronutrients,14,FALSE)","v":0},{"$f":"VLOOKUP(Y39,Micronutrients,18,FALSE)","v":0},{"$f":"VLOOKUP(Y39,Micronutrients,16,FALSE)","v":1},0,{"$f":"VLOOKUP(Y39,Micronutrients,15,FALSE)","v":0},{"$f":"(AC39*VLOOKUP(Y39,Micronutrients,14,FALSE)/AB39)*AA39","v":0},null,{"$f":"VLOOKUP(Y30,Macronutrients,11,FALSE)*AC30+VLOOKUP(Y31,Macronutrients,11,FALSE)*AC31+VLOOKUP(Y32,Macronutrients,11,FALSE)*AC32+VLOOKUP(Y33,Macronutrients,11,FALSE)*AC33+VLOOKUP(Y34,Macronutrients,11,FALSE)*AC34+VLOOKUP(Y35,Macronutrients,11,FALSE)*AC35+VLOOKUP(Y38,Micronutrients,11,FALSE)*AC38+VLOOKUP(Y39,Micronutrients,11,FALSE)*AC39+VLOOKUP(Y40,Micronutrients,11,FALSE)*AC40+VLOOKUP(Y41,Micronutrients,11,FALSE)*AC41","v":0},{"$f":"VLOOKUP(Y30,Macronutrients,12,FALSE)*AC30+VLOOKUP(Y31,Macronutrients,12,FALSE)*AC31+VLOOKUP(Y32,Macronutrients,12,FALSE)*AC32+VLOOKUP(Y33,Macronutrients,12,FALSE)*AC33+VLOOKUP(Y34,Macronutrients,12,FALSE)*AC34+VLOOKUP(Y35,Macronutrients,12,FALSE)*AC35+VLOOKUP(Y38,Micronutrients,12,FALSE)*AC38+VLOOKUP(Y39,Micronutrients,12,FALSE)*AC39+VLOOKUP(Y40,Micronutrients,12,FALSE)*AC40+VLOOKUP(Y41,Micronutrients,12,FALSE)*AC41","v":0},{"$f":"VLOOKUP(Y30,Macronutrients,13,FALSE)*AC30+VLOOKUP(Y31,Macronutrients,13,FALSE)*AC31+VLOOKUP(Y32,Macronutrients,13,FALSE)*AC32+VLOOKUP(Y33,Macronutrients,13,FALSE)*AC33+VLOOKUP(Y34,Macronutrients,13,FALSE)*AC34+VLOOKUP(Y35,Macronutrients,13,FALSE)*AC35+VLOOKUP(Y38,Micronutrients,13,FALSE)*AC38+VLOOKUP(Y39,Micronutrients,13,FALSE)*AC39+VLOOKUP(Y40,Micronutrients,13,FALSE)*AC40+VLOOKUP(Y41,Micronutrients,13,FALSE)*AC41","v":0}]
["None",{"$f":"VLOOKUP($A40,Micronutrients,14,FALSE)","v":0},{"$f":"VLOOKUP(A40,Micronutrients,18,FALSE)","v":0},{"$f":"VLOOKUP(A40,Micronutrients,16,FALSE)","v":1},0,{"$f":"VLOOKUP(A40,Micronutrients,15,FALSE)","v":0},{"$f":"(E40*VLOOKUP(A40,Micronutrients,14,FALSE)/D40)*C40","v":0},null,null,null,null,null,"None",{"$f":"VLOOKUP($M40,Micronutrients,14,FALSE)","v":0},{"$f":"VLOOKUP(M40,Micronutrients,18,FALSE)","v":0},{"$f":"VLOOKUP(M40,Micronutrients,16,FALSE)","v":1},0,{"$f":"VLOOKUP(M40,Micronutrients,15,FALSE)","v":0},{"$f":"(Q40*VLOOKUP(M40,Micronutrients,14,FALSE)/P40)*O40","v":0},null,null,null,null,null,"None",{"$f":"VLOOKUP(Y40,Micronutrients,14,FALSE)","v":0},{"$f":"VLOOKUP(Y40,Micronutrients,18,FALSE)","v":0},{"$f":"VLOOKUP(Y40,Micronutrients,16,FALSE)","v":1},0,{"$f":"VLOOKUP(Y40,Micronutrients,15,FALSE)","v":0},{"$f":"(AC40*VLOOKUP(Y40,Micronutrients,14,FALSE)/AB40)*AA40","v":0}]
["None",{"$f":"VLOOKUP($A41,Micronutrients,14,FALSE)","v":0},{"$f":"VLOOKUP(A41,Micronutrients,18,FALSE)","v":0},{"$f":"VLOOKUP(A41,Micronutrients,16,FALSE)","v":1},0,{"$f":"VLOOKUP(A41,Micronutrients,15,FALSE)","v":0},{"$f":"(E41*VLOOKUP(A41,Micronutrients,14,FALSE)/D41)*C41","v":0},null,null,null,null,null,"None",{"$f":"VLOOKUP($M41,Micronutrients,14,FALSE)","v":0},{"$f":"VLOOKUP(M41,Micronutrients,18,FALSE)","v":0},{"$f":"VLOOKUP(M41,Micronutrients,16,FALSE)","v":1},0,{"$f":"VLOOKUP(M41,Micronutrients,15,FALSE)","v":0},{"$f":"(Q41*VLOOKUP(M41,Micronutrients,14,FALSE)/P41)*O41","v":0},null,null,null,null,null,"None",{"$f":"VLOOKUP(Y41,Micronutrients,14,FALSE)","v":0},{"$f":"VLOOKUP(Y41,Micronutrients,18,FALSE)","v":0},{"$f":"VLOOKUP(Y41,Micronutrients,16,FALSE)","v":1},0,{"$f":"VLOOKUP(Y41,Micronutrients,15,FALSE)","v":0},{"$f":"(AC41*VLOOKUP(Y41,Micronutrients,14,FALSE)/AB41)*AA41","v":0}]
[]
["Nitrogen Stabilizers (drop down menu)",null,null,null,null,null,null,null,null,null,null,null,"Nitrogen Stabilizers (drop down menu)",null,null,null,null,null,null,null,null,null,null,null,"Nitrogen Stabilizers (drop down menu)"]
["None",{"$f":"VLOOKUP(A44,NitrogenStabilizers,14,FALSE)","v":0},{"$f":"VLOOKUP(A44,NitrogenStabilizers,18,FALSE)","v":0},{"$f":"VLOOKUP(A44,NitrogenStabilizers,16,FALSE)","v":1},0,{"$f":"VLOOKUP(A44,NitrogenStabilizers,15,FALSE)","v":0},{"$f":"(E44*VLOOKUP(A44,NitrogenStabilizers,14,FALSE)/D44)*C44","v":0},null,null,null,null,null,"None",{"$f":"VLOOKUP(M44,NitrogenStabilizers,14,FALSE)","v":0},{"$f":"VLOOKUP(M44,NitrogenStabilizers,18,FALSE)","v":0},{"$f":"VLOOKUP(M44,NitrogenStabilizers,16,FALSE)","v":1},0,{"$f":"VLOOKUP(M44,NitrogenStabilizers,15,FALSE)","v":0},{"$f":"(Q44*VLOOKUP(M44,NitrogenStabilizers,14,FALSE)/P44)*O44","v":0},null,null,null,null,null,"None",{"$f":"VLOOKUP(Y44,NitrogenStabilizers,14,FALSE)","v":0},{"$f":"VLOOKUP(Y44,NitrogenStabilizers,18,FALSE)","v":0},{"$f":"VLOOKUP(Y44,NitrogenStabilizers,16,FALSE)","v":1},0,{"$f":"VLOOKUP(Y44,NitrogenStabilizers,15,FALSE)","v":0},{"$f":"(AC44*VLOOKUP(Y44,NitrogenStabilizers,14,FALSE)/AB44)*AA44","v":0}]
["None",{"$f":"VLOOKUP(A45,NitrogenStabilizers,14,FALSE)","v":0},{"$f":"VLOOKUP(A45,NitrogenStabilizers,18,FALSE)","v":0},{"$f":"VLOOKUP(A45,NitrogenStabilizers,16,FALSE)","v":1},0,{"$f":"VLOOKUP(A45,NitrogenStabilizers,15,FALSE)","v":0},{"$f":"(E45*VLOOKUP(A45,NitrogenStabilizers,14,FALSE)/D45)*C45","v":0},null,null,null,"More",null,"None",{"$f":"VLOOKUP(M45,NitrogenStabilizers,14,FALSE)","v":0},{"$f":"VLOOKUP(M45,NitrogenStabilizers,18,FALSE)","v":0},{"$f":"VLOOKUP(M45,NitrogenStabilizers,16,FALSE)","v":1},0,{"$f":"VLOOKUP(M45,NitrogenStabilizers,15,FALSE)","v":0},{"$f":"(Q45*VLOOKUP(M45,NitrogenStabilizers,14,FALSE)/P45)*O45","v":0},null,null,null,"More",null,"None",{"$f":"VLOOKUP(Y45,NitrogenStabilizers,14,FALSE)","v":0},{"$f":"VLOOKUP(Y45,NitrogenStabilizers,18,FALSE)","v":0},{"$f":"VLOOKUP(Y45,NitrogenStabilizers,16,FALSE)","v":1},0,{"$f":"VLOOKUP(Y45,NitrogenStabilizers,15,FALSE)","v":0},{"$f":"(AC45*VLOOKUP(Y45,NitrogenStabilizers,14,FALSE)/AB45)*AA45","v":0},null,null,null,"More"]
["2nd Application Fertilizer Cost/Acre",null,null,null,null,null,{"$f":"SUM(G30:G45)","v":0},null,null,null,"Below",null,"2nd Application Fertilizer Cost/Acre",null,null,null,null,null,{"$f":"SUM(S30:S45)","v":0},null,null,null,"Below",null,"2nd Application Fertilizer Cost/Acre",null,null,null,null,null,{"$f":"SUM(AE30:AE45)","v":0},null,null,null,"Below"]
[null,null,null,null,null,null,null,null,null,null,"¯",null,null,null,null,null,null,null,null,null,null,null,"¯",null,null,null,null,null,null,null,null,null,null,null,"¯"]
["3rd Application (i.e., Side-Dress or Broadcast or Fertigation)",null,null,null,null,null,null,null,null,null,null,null,"3rd Application (i.e., Side-Dress or Broadcast or Fertigation)",null,null,null,null,null,null,null,null,null,null,null,"3rd Application (i.e., Side-Dress or Broadcast or Fertigation)"]
["Fertilizer Source","Purchase Units","Package Price (Gals, Lbs, etc.)","Units/Pkg","Rate/Acre","Units","Cost",null,null,null,null,null,"Fertilizer Source","Purchase Units","Package Price (Gals, Lbs, etc.)","Units/Pkg","Rate/Acre","Units","Cost",null,null,null,null,null,"Fertilizer Source","Purchase Units","Package Price (Gals, Lbs, etc.)","Units/Pkg","Rate/Acre","Units","Cost"]
["Macronutrients (drop down menu)",null,null,null,"(Enter Below)",null,null,null,"N","P","K",null,"Macronutrients (drop down menu)",null,null,null,"(Enter Below)",null,null,null,"N","P","K",null,"Macronutrients (drop down menu)",null,null,null,"(Enter Below)",null,null,null,"N","P","K"]
["None",{"$f":"VLOOKUP(A51,Macronutrients,14,FALSE)","v":0},{"$f":"VLOOKUP(A51,Macronutrients,18,FALSE)","v":0},{"$f":"VLOOKUP(A51,Macronutrients,16,FALSE)","v":1},0,{"$f":"VLOOKUP(A51,Macronutrients,15,FALSE)","v":0},{"$f":"(E51*VLOOKUP(A51,Macronutrients,14,FALSE)/D51)*C51","v":0},null,{"$f":"VLOOKUP(A51,Macronutrients,2,FALSE)*E51+VLOOKUP(A52,Macronutrients,2,FALSE)*E52+VLOOKUP(A53,Macronutrients,2,FALSE)*E53+VLOOKUP(A54,Macronutrients,2,FALSE)*E54+VLOOKUP(A55,Macronutrients,2,FALSE)*E55+VLOOKUP(A56,Macronutrients,2,FALSE)*E56+VLOOKUP(A59,Micronutrients,2,FALSE)*E59+VLOOKUP(A60,Micronutrients,2,FALSE)*E60+VLOOKUP(A61,Micronutrients,2,FALSE)*E61+VLOOKUP(A62,Micronutrients,2,FALSE)*E62","v":0},{"$f":"VLOOKUP(A51,Macronutrients,3,FALSE)*E51+VLOOKUP(A52,Macronutrients,3,FALSE)*E52+VLOOKUP(A53,Macronutrients,3,FALSE)*E53+VLOOKUP(A54,Macronutrients,3,FALSE)*E54+VLOOKUP(A55,Macronutrients,3,FALSE)*E55+VLOOKUP(A56,Macronutrients,3,FALSE)*E56+VLOOKUP(A59,Micronutrients,3,FALSE)*E59+VLOOKUP(A60,Micronutrients,3,FALSE)*E60+VLOOKUP(A61,Micronutrients,3,FALSE)*E61+VLOOKUP(A62,Micronutrients,3,FALSE)*E62","v":0},{"$f":"VLOOKUP(A51,Macronutrients,4,FALSE)*E51+VLOOKUP(A52,Macronutrients,4,FALSE)*E52+VLOOKUP(A53,Macronutrients,4,FALSE)*E53+VLOOKUP(A54,Macronutrients,4,FALSE)*E54+VLOOKUP(A55,Macronutrients,4,FALSE)*E55+VLOOKUP(A56,Macronutrients,4,FALSE)*E56+VLOOKUP(A59,Micronutrients,4,FALSE)*E59+VLOOKUP(A60,Micronutrients,4,FALSE)*E60+VLOOKUP(A61,Micronutrients,4,FALSE)*E61+VLOOKUP(A62,Micronutrients,4,FALSE)*E62","v":0},null,"None",{"$f":"VLOOKUP(M51,Macronutrients,14,FALSE)","v":0},{"$f":"VLOOKUP(M51,Macronutrients,18,FALSE)","v":0},{"$f":"VLOOKUP(M51,Macronutrients,16,FALSE)","v":1},0,{"$f":"VLOOKUP(M51,Macronutrients,15,FALSE)","v":0},{"$f":"(Q51*VLOOKUP(M51,Macronutrients,14,FALSE)/P51)*O51","v":0},null,{"$f":"VLOOKUP(M51,Macronutrients,2,FALSE)*Q51+VLOOKUP(M52,Macronutrients,2,FALSE)*Q52+VLOOKUP(M53,Macronutrients,2,FALSE)*Q53+VLOOKUP(M54,Macronutrients,2,FALSE)*Q54+VLOOKUP(M55,Macronutrients,2,FALSE)*Q55+VLOOKUP(M56,Macronutrients,2,FALSE)*Q56+VLOOKUP(M59,Micronutrients,2,FALSE)*Q59+VLOOKUP(M60,Micronutrients,2,FALSE)*Q60+VLOOKUP(M61,Micronutrients,2,FALSE)*Q61+VLOOKUP(M62,Micronutrients,2,FALSE)*Q62","v":0},{"$f":"VLOOKUP(M51,Macronutrients,3,FALSE)*Q51+VLOOKUP(M52,Macronutrients,3,FALSE)*Q52+VLOOKUP(M53,Macronutrients,3,FALSE)*Q53+VLOOKUP(M54,Macronutrients,3,FALSE)*Q54+VLOOKUP(M55,Macronutrients,3,FALSE)*Q55+VLOOKUP(M56,Macronutrients,3,FALSE)*Q56+VLOOKUP(M59,Micronutrients,3,FALSE)*Q59+VLOOKUP(M60,Micronutrients,3,FALSE)*Q60+VLOOKUP(M61,Micronutrients,3,FALSE)*Q61+VLOOKUP(M62,Micronutrients,3,FALSE)*Q62","v":0},{"$f":"VLOOKUP(M51,Macronutrients,4,FALSE)*Q51+VLOOKUP(M52,Macronutrients,4,FALSE)*Q52+VLOOKUP(M53,Macronutrients,4,FALSE)*Q53+VLOOKUP(M54,Macronutrients,4,FALSE)*Q54+VLOOKUP(M55,Macronutrients,4,FALSE)*Q55+VLOOKUP(M56,Macronutrients,4,FALSE)*Q56+VLOOKUP(M59,Micronutrients,4,FALSE)*Q59+VLOOKUP(M60,Micronutrients,4,FALSE)*Q60+VLOOKUP(M61,Micronutrients,4,FALSE)*Q61+VLOOKUP(M62,Micronutrients,4,FALSE)*Q62","v":0},null,"None",{"$f":"VLOOKUP(Y51,Macronutrients,14,FALSE)","v":0},{"$f":"VLOOKUP(Y51,Macronutrients,18,FALSE)","v":0},{"$f":"VLOOKUP(Y51,Macronutrients,16,FALSE)","v":1},0,{"$f":"VLOOKUP(Y51,Macronutrients,15,FALSE)","v":0},{"$f":"(AC51*VLOOKUP(Y51,Macronutrients,14,FALSE)/AB51)*AA51","v":0},null,{"$f":"VLOOKUP(Y51,Macronutrients,2,FALSE)*AC51+VLOOKUP(Y52,Macronutrients,2,FALSE)*AC52+VLOOKUP(Y53,Macronutrients,2,FALSE)*AC53+VLOOKUP(Y54,Macronutrients,2,FALSE)*AC54+VLOOKUP(Y55,Macronutrients,2,FALSE)*AC55+VLOOKUP(Y56,Macronutrients,2,FALSE)*AC56+VLOOKUP(Y59,Micronutrients,2,FALSE)*AC59+VLOOKUP(Y60,Micronutrients,2,FALSE)*AC60+VLOOKUP(Y61,Micronutrients,2,FALSE)*AC61+VLOOKUP(Y62,Micronutrients,2,FALSE)*AC62","v":0},{"$f":"VLOOKUP(Y51,Macronutrients,3,FALSE)*AC51+VLOOKUP(Y52,Macronutrients,3,FALSE)*AC52+VLOOKUP(Y53,Macronutrients,3,FALSE)*AC53+VLOOKUP(Y54,Macronutrients,3,FALSE)*AC54+VLOOKUP(Y55,Macronutrients,3,FALSE)*AC55+VLOOKUP(Y56,Macronutrients,3,FALSE)*AC56+VLOOKUP(Y59,Micronutrients,3,FALSE)*AC59+VLOOKUP(Y60,Micronutrients,3,FALSE)*AC60+VLOOKUP(Y61,Micronutrients,3,FALSE)*AC61+VLOOKUP(Y62,Micronutrients,3,FALSE)*AC62","v":0},{"$f":"VLOOKUP(Y51,Macronutrients,4,FALSE)*AC51+VLOOKUP(Y52,Macronutrients,4,FALSE)*AC52+VLOOKUP(Y53,Macronutrients,4,FALSE)*AC53+VLOOKUP(Y54,Macronutrients,4,FALSE)*AC54+VLOOKUP(Y55,Macronutrients,4,FALSE)*AC55+VLOOKUP(Y56,Macronutrients,4,FALSE)*AC56+VLOOKUP(Y59,Micronutrients,4,FALSE)*AC59+VLOOKUP(Y60,Micronutrients,4,FALSE)*AC60+VLOOKUP(Y61,Micronutrients,4,FALSE)*AC61+VLOOKUP(Y62,Micronutrients,4,FALSE)*AC62","v":0}]
["None",0,0,1,0,0,0,null,null,null,null,null,"None",0,0,1,0,0,0,null,null,null,null,null,"None",0,0,1,0,0,0]
["None",0,0,1,0,0,0,null,"S","Ca","Mg",null,"None",0,0,1,0,0,0,null,"S","Ca","Mg",null,"None",0,0,1,0,0,0,null,"S","Ca","Mg"]
["None",0,0,1,0,0,0,null,{"$f":"VLOOKUP(A51,Macronutrients,5,FALSE)*E51+VLOOKUP(A52,Macronutrients,5,FALSE)*E52+VLOOKUP(A53,Macronutrients,5,FALSE)*E53+VLOOKUP(A54,Macronutrients,5,FALSE)*E54+VLOOKUP(A55,Macronutrients,5,FALSE)*E55+VLOOKUP(A56,Macronutrients,5,FALSE)*E56+VLOOKUP(A59,Micronutrients,5,FALSE)*E59+VLOOKUP(A60,Micronutrients,5,FALSE)*E60+VLOOKUP(A61,Micronutrients,5,FALSE)*E61+VLOOKUP(A62,Micronutrients,5,FALSE)*E62","v":0},{"$f":"VLOOKUP(A51,Macronutrients,7,FALSE)*E51+VLOOKUP(A52,Macronutrients,7,FALSE)*E52+VLOOKUP(A53,Macronutrients,7,FALSE)*E53+VLOOKUP(A54,Macronutrients,7,FALSE)*E54+VLOOKUP(A55,Macronutrients,7,FALSE)*E55+VLOOKUP(A56,Macronutrients,7,FALSE)*E56+VLOOKUP(A59,Micronutrients,7,FALSE)*E59+VLOOKUP(A60,Micronutrients,7,FALSE)*E60+VLOOKUP(A61,Micronutrients,7,FALSE)*E61+VLOOKUP(A62,Micronutrients,7,FALSE)*E62","v":0},{"$f":"VLOOKUP($A51,Macronutrients,6,FALSE)*$E$6+VLOOKUP($A52,Macronutrients,6,FALSE)*$E$7+VLOOKUP($A53,Macronutrients,6,FALSE)*$E$8+VLOOKUP($A54,Macronutrients,6,FALSE)*$E$9+VLOOKUP($A55,Macronutrients,6,FALSE)*$E$10+VLOOKUP($A56,Macronutrients,6,FALSE)*$E$11+VLOOKUP($A59,Micronutrients,6,FALSE)*$E$14+VLOOKUP($A60,Micronutrients,6,FALSE)*E60+VLOOKUP($A61,Micronutrients,6,FALSE)*$E$16+VLOOKUP($A62,Micronutrients,6,FALSE)*$E$17","v":0},null,"None",0,0,1,0,0,0,null,{"$f":"VLOOKUP(M51,Macronutrients,5,FALSE)*Q51+VLOOKUP(M52,Macronutrients,5,FALSE)*Q52+VLOOKUP(M53,Macronutrients,5,FALSE)*Q53+VLOOKUP(M54,Macronutrients,5,FALSE)*Q54+VLOOKUP(M55,Macronutrients,5,FALSE)*Q55+VLOOKUP(M56,Macronutrients,5,FALSE)*Q56+VLOOKUP(M59,Micronutrients,5,FALSE)*Q59+VLOOKUP(M60,Micronutrients,5,FALSE)*Q60+VLOOKUP(M61,Micronutrients,5,FALSE)*Q61+VLOOKUP(M62,Micronutrients,5,FALSE)*Q62","v":0},{"$f":"VLOOKUP(M51,Macronutrients,7,FALSE)*Q51+VLOOKUP(M52,Macronutrients,7,FALSE)*Q52+VLOOKUP(M53,Macronutrients,7,FALSE)*Q53+VLOOKUP(M54,Macronutrients,7,FALSE)*Q54+VLOOKUP(M55,Macronutrients,7,FALSE)*Q55+VLOOKUP(M56,Macronutrients,7,FALSE)*Q56+VLOOKUP(M59,Micronutrients,7,FALSE)*Q59+VLOOKUP(M60,Micronutrients,7,FALSE)*Q60+VLOOKUP(M61,Micronutrients,7,FALSE)*Q61+VLOOKUP(M62,Micronutrients,7,FALSE)*Q62","v":0},{"$f":"VLOOKUP($A51,Macronutrients,6,FALSE)*$E$6+VLOOKUP($A52,Macronutrients,6,FALSE)*$E$7+VLOOKUP($A53,Macronutrients,6,FALSE)*$E$8+VLOOKUP($A54,Macronutrients,6,FALSE)*$E$9+VLOOKUP($A55,Macronutrients,6,FALSE)*$E$10+VLOOKUP($A56,Macronutrients,6,FALSE)*$E$11+VLOOKUP($A59,Micronutrients,6,FALSE)*$E$14+VLOOKUP($A60,Micronutrients,6,FALSE)*Q60+VLOOKUP($A61,Micronutrients,6,FALSE)*$E$16+VLOOKUP($A62,Micronutrients,6,FALSE)*$E$17","v":0},null,"None",0,0,1,0,0,0,null,{"$f":"VLOOKUP(Y51,Macronutrients,5,FALSE)*AC51+VLOOKUP(Y52,Macronutrients,5,FALSE)*AC52+VLOOKUP(Y53,Macronutrients,5,FALSE)*AC53+VLOOKUP(Y54,Macronutrients,5,FALSE)*AC54+VLOOKUP(Y55,Macronutrients,5,FALSE)*AC55+VLOOKUP(Y56,Macronutrients,5,FALSE)*AC56+VLOOKUP(Y59,Micronutrients,5,FALSE)*AC59+VLOOKUP(Y60,Micronutrients,5,FALSE)*AC60+VLOOKUP(Y61,Micronutrients,5,FALSE)*AC61+VLOOKUP(Y62,Micronutrients,5,FALSE)*AC62","v":0},{"$f":"VLOOKUP(Y51,Macronutrients,7,FALSE)*AC51+VLOOKUP(Y52,Macronutrients,7,FALSE)*AC52+VLOOKUP(Y53,Macronutrients,7,FALSE)*AC53+VLOOKUP(Y54,Macronutrients,7,FALSE)*AC54+VLOOKUP(Y55,Macronutrients,7,FALSE)*AC55+VLOOKUP(Y56,Macronutrients,7,FALSE)*AC56+VLOOKUP(Y59,Micronutrients,7,FALSE)*AC59+VLOOKUP(Y60,Micronutrients,7,FALSE)*AC60+VLOOKUP(Y61,Micronutrients,7,FALSE)*AC61+VLOOKUP(Y62,Micronutrients,7,FALSE)*AC62","v":0},{"$f":"VLOOKUP($A51,Macronutrients,6,FALSE)*$E$6+VLOOKUP($A52,Macronutrients,6,FALSE)*$E$7+VLOOKUP($A53,Macronutrients,6,FALSE)*$E$8+VLOOKUP($A54,Macronutrients,6,FALSE)*$E$9+VLOOKUP($A55,Macronutrients,6,FALSE)*$E$10+VLOOKUP($A56,Macronutrients,6,FALSE)*$E$11+VLOOKUP($A59,Micronutrients,6,FALSE)*$E$14+VLOOKUP($A60,Micronutrients,6,FALSE)*AC60+VLOOKUP($A61,Micronutrients,6,FALSE)*$E$16+VLOOKUP($A62,Micronutrients,6,FALSE)*$E$17","v":0}]
["None",0,0,1,0,0,0,null,null,null,null,null,"None",0,0,1,0,0,0,null,null,null,null,null,"None",0,0,1,0,0,0]
["None",0,0,1,0,0,0,null,"Z","B","Mn",null,"None",0,0,1,0,0,0,null,"Z","B","Mn",null,"None",0,0,1,0,0,0,null,"Z","B","Mn"]
[null,null,null,null,null,null,null,null,{"$f":"VLOOKUP(A51,Macronutrients,8,FALSE)*E51+VLOOKUP(A52,Macronutrients,8,FALSE)*E52+VLOOKUP(A53,Macronutrients,8,FALSE)*E53+VLOOKUP(A54,Macronutrients,8,FALSE)*E54+VLOOKUP(A55,Macronutrients,8,FALSE)*E55+VLOOKUP(A56,Macronutrients,8,FALSE)*E56+VLOOKUP(A59,Micronutrients,8,FALSE)*E59+VLOOKUP(A60,Micronutrients,8,FALSE)*E60+VLOOKUP(A61,Micronutrients,8,FALSE)*E61+VLOOKUP(A62,Micronutrients,8,FALSE)*E62","v":0},{"$f":"VLOOKUP(A51,Macronutrients,9,FALSE)*E51+VLOOKUP(A52,Macronutrients,9,FALSE)*E52+VLOOKUP(A53,Macronutrients,9,FALSE)*E53+VLOOKUP(A54,Macronutrients,9,FALSE)*E54+VLOOKUP(A55,Macronutrients,9,FALSE)*E55+VLOOKUP(A56,Macronutrients,9,FALSE)*E56+VLOOKUP(A59,Micronutrients,9,FALSE)*E59+VLOOKUP(A60,Micronutrients,9,FALSE)*E60+VLOOKUP(A61,Micronutrients,9,FALSE)*E61+VLOOKUP(A62,Micronutrients,9,FALSE)*E62","v":0},{"$f":"VLOOKUP(A51,Macronutrients,10,FALSE)*E51+VLOOKUP(A52,Macronutrients,10,FALSE)*E52+VLOOKUP(A53,Macronutrients,10,FALSE)*E53+VLOOKUP(A54,Macronutrients,10,FALSE)*E54+VLOOKUP(A55,Macronutrients,10,FALSE)*E55+VLOOKUP(A56,Macronutrients,10,FALSE)*E56+VLOOKUP(A59,Micronutrients,10,FALSE)*E59+VLOOKUP(A60,Micronutrients,10,FALSE)*E60+VLOOKUP(A61,Micronutrients,10,FALSE)*E61+VLOOKUP(A62,Micronutrients,10,FALSE)*E62","v":0},null,null,null,null,null,null,null,null,null,{"$f":"VLOOKUP(M51,Macronutrients,8,FALSE)*Q51+VLOOKUP(M52,Macronutrients,8,FALSE)*Q52+VLOOKUP(M53,Macronutrients,8,FALSE)*Q53+VLOOKUP(M54,Macronutrients,8,FALSE)*Q54+VLOOKUP(M55,Macronutrients,8,FALSE)*Q55+VLOOKUP(M56,Macronutrients,8,FALSE)*Q56+VLOOKUP(M59,Micronutrients,8,FALSE)*Q59+VLOOKUP(M60,Micronutrients,8,FALSE)*Q60+VLOOKUP(M61,Micronutrients,8,FALSE)*Q61+VLOOKUP(M62,Micronutrients,8,FALSE)*Q62","v":0},{"$f":"VLOOKUP(M51,Macronutrients,9,FALSE)*Q51+VLOOKUP(M52,Macronutrients,9,FALSE)*Q52+VLOOKUP(M53,Macronutrients,9,FALSE)*Q53+VLOOKUP(M54,Macronutrients,9,FALSE)*Q54+VLOOKUP(M55,Macronutrients,9,FALSE)*Q55+VLOOKUP(M56,Macronutrients,9,FALSE)*Q56+VLOOKUP(M59,Micronutrients,9,FALSE)*Q59+VLOOKUP(M60,Micronutrients,9,FALSE)*Q60+VLOOKUP(M61,Micronutrients,9,FALSE)*Q61+VLOOKUP(M62,Micronutrients,9,FALSE)*Q62","v":0},{"$f":"VLOOKUP(M51,Macronutrients,10,FALSE)*Q51+VLOOKUP(M52,Macronutrients,10,FALSE)*Q52+VLOOKUP(M53,Macronutrients,10,FALSE)*Q53+VLOOKUP(M54,Macronutrients,10,FALSE)*Q54+VLOOKUP(M55,Macronutrients,10,FALSE)*Q55+VLOOKUP(M56,Macronutrients,10,FALSE)*Q56+VLOOKUP(M59,Micronutrients,10,FALSE)*Q59+VLOOKUP(M60,Micronutrients,10,FALSE)*Q60+VLOOKUP(M61,Micronutrients,10,FALSE)*Q61+VLOOKUP(M62,Micronutrients,10,FALSE)*Q62","v":0},null,null,null,null,null,null,null,null,null,{"$f":"VLOOKUP(Y51,Macronutrients,8,FALSE)*AC51+VLOOKUP(Y52,Macronutrients,8,FALSE)*AC52+VLOOKUP(Y53,Macronutrients,8,FALSE)*AC53+VLOOKUP(Y54,Macronutrients,8,FALSE)*AC54+VLOOKUP(Y55,Macronutrients,8,FALSE)*AC55+VLOOKUP(Y56,Macronutrients,8,FALSE)*AC56+VLOOKUP(Y59,Micronutrients,8,FALSE)*AC59+VLOOKUP(Y60,Micronutrients,8,FALSE)*AC60+VLOOKUP(Y61,Micronutrients,8,FALSE)*AC61+VLOOKUP(Y62,Micronutrients,8,FALSE)*AC62","v":0},{"$f":"VLOOKUP(Y51,Macronutrients,9,FALSE)*AC51+VLOOKUP(Y52,Macronutrients,9,FALSE)*AC52+VLOOKUP(Y53,Macronutrients,9,FALSE)*AC53+VLOOKUP(Y54,Macronutrients,9,FALSE)*AC54+VLOOKUP(Y55,Macronutrients,9,FALSE)*AC55+VLOOKUP(Y56,Macronutrients,9,FALSE)*AC56+VLOOKUP(Y59,Micronutrients,9,FALSE)*AC59+VLOOKUP(Y60,Micronutrients,9,FALSE)*AC60+VLOOKUP(Y61,Micronutrients,9,FALSE)*AC61+VLOOKUP(Y62,Micronutrients,9,FALSE)*AC62","v":0},{"$f":"VLOOKUP(Y51,Macronutrients,10,FALSE)*AC51+VLOOKUP(Y52,Macronutrients,10,FALSE)*AC52+VLOOKUP(Y53,Macronutrients,10,FALSE)*AC53+VLOOKUP(Y54,Macronutrients,10,FALSE)*AC54+VLOOKUP(Y55,Macronutrients,10,FALSE)*AC55+VLOOKUP(Y56,Macronutrients,10,FALSE)*AC56+VLOOKUP(Y59,Micronutrients,10,FALSE)*AC59+VLOOKUP(Y60,Micronutrients,10,FALSE)*AC60+VLOOKUP(Y61,Micronutrients,10,FALSE)*AC61+VLOOKUP(Y62,Micronutrients,10,FALSE)*AC62","v":0}]
["Micronutrients (drop down menu)",null,null,null,null,null,null,null,null,null,null,null,"Micronutrients (drop down menu)",null,null,null,null,null,null,null,null,null,null,null,"Micronutrients (drop down menu)"]
["None",{"$f":"VLOOKUP($A59,Micronutrients,14,FALSE)","v":0},{"$f":"VLOOKUP(A59,Micronutrients,18,FALSE)","v":0},{"$f":"VLOOKUP(A59,Micronutrients,16,FALSE)","v":1},0,{"$f":"VLOOKUP(A59,Micronutrients,15,FALSE)","v":0},{"$f":"(E59*VLOOKUP(A59,Micronutrients,14,FALSE)/D59)*C59","v":0},null,"Cu","Mo","Fe",null,"None",{"$f":"VLOOKUP($M59,Micronutrients,14,FALSE)","v":0},{"$f":"VLOOKUP(M59,Micronutrients,18,FALSE)","v":0},{"$f":"VLOOKUP(M59,Micronutrients,16,FALSE)","v":1},0,{"$f":"VLOOKUP(M59,Micronutrients,15,FALSE)","v":0},{"$f":"(Q59*VLOOKUP(M59,Micronutrients,14,FALSE)/P59)*O59","v":0},null,"Cu","Mo","Fe",null,"None",{"$f":"VLOOKUP(Y59,Micronutrients,14,FALSE)","v":0},{"$f":"VLOOKUP(Y59,Micronutrients,18,FALSE)","v":0},{"$f":"VLOOKUP(Y59,Micronutrients,16,FALSE)","v":1},0,{"$f":"VLOOKUP(Y59,Micronutrients,15,FALSE)","v":0},{"$f":"(AC59*VLOOKUP(Y59,Micronutrients,14,FALSE)/AB59)*AA59","v":0},null,"Cu","Mo","Fe"]
["None",{"$f":"VLOOKUP($A60,Micronutrients,14,FALSE)","v":0},{"$f":"VLOOKUP(A60,Micronutrients,18,FALSE)","v":0},{"$f":"VLOOKUP(A60,Micronutrients,16,FALSE)","v":1},0,{"$f":"VLOOKUP(A60,Micronutrients,15,FALSE)","v":0},{"$f":"(E60*VLOOKUP(A60,Micronutrients,14,FALSE)/D60)*C60","v":0},null,{"$f":"VLOOKUP(A51,Macronutrients,11,FALSE)*E51+VLOOKUP(A52,Macronutrients,11,FALSE)*E52+VLOOKUP(A53,Macronutrients,11,FALSE)*E53+VLOOKUP(A54,Macronutrients,11,FALSE)*E54+VLOOKUP(A55,Macronutrients,11,FALSE)*E55+VLOOKUP(A56,Macronutrients,11,FALSE)*E56+VLOOKUP(A59,Micronutrients,11,FALSE)*E59+VLOOKUP(A60,Micronutrients,11,FALSE)*E60+VLOOKUP(A61,Micronutrients,11,FALSE)*E61+VLOOKUP(A62,Micronutrients,11,FALSE)*E62","v":0},{"$f":"VLOOKUP(A51,Macronutrients,12,FALSE)*E51+VLOOKUP(A52,Macronutrients,12,FALSE)*E52+VLOOKUP(A53,Macronutrients,12,FALSE)*E53+VLOOKUP(A54,Macronutrients,12,FALSE)*E54+VLOOKUP(A55,Macronutrients,12,FALSE)*E55+VLOOKUP(A56,Macronutrients,12,FALSE)*E56+VLOOKUP(A59,Micronutrients,12,FALSE)*E59+VLOOKUP(A60,Micronutrients,12,FALSE)*E60+VLOOKUP(A61,Micronutrients,12,FALSE)*E61+VLOOKUP(A62,Micronutrients,12,FALSE)*E62","v":0},{"$f":"VLOOKUP(A51,Macronutrients,13,FALSE)*E51+VLOOKUP(A52,Macronutrients,13,FALSE)*E52+VLOOKUP(A53,Macronutrients,13,FALSE)*E53+VLOOKUP(A54,Macronutrients,13,FALSE)*E54+VLOOKUP(A55,Macronutrients,13,FALSE)*E55+VLOOKUP(A56,Macronutrients,13,FALSE)*E56+VLOOKUP(A59,Micronutrients,13,FALSE)*E59+VLOOKUP(A60,Micronutrients,13,FALSE)*E60+VLOOKUP(A61,Micronutrients,13,FALSE)*E61+VLOOKUP(A62,Micronutrients,13,FALSE)*E62","v":0},null,"None",{"$f":"VLOOKUP($M60,Micronutrients,14,FALSE)","v":0},{"$f":"VLOOKUP(M60,Micronutrients,18,FALSE)","v":0},{"$f":"VLOOKUP(M60,Micronutrients,16,FALSE)","v":1},0,{"$f":"VLOOKUP(M60,Micronutrients,15,FALSE)","v":0},{"$f":"(Q60*VLOOKUP(M60,Micronutrients,14,FALSE)/P60)*O60","v":0},null,{"$f":"VLOOKUP(M51,Macronutrients,11,FALSE)*Q51+VLOOKUP(M52,Macronutrients,11,FALSE)*Q52+VLOOKUP(M53,Macronutrients,11,FALSE)*Q53+VLOOKUP(M54,Macronutrients,11,FALSE)*Q54+VLOOKUP(M55,Macronutrients,11,FALSE)*Q55+VLOOKUP(M56,Macronutrients,11,FALSE)*Q56+VLOOKUP(M59,Micronutrients,11,FALSE)*Q59+VLOOKUP(M60,Micronutrients,11,FALSE)*Q60+VLOOKUP(M61,Micronutrients,11,FALSE)*Q61+VLOOKUP(M62,Micronutrients,11,FALSE)*Q62","v":0},{"$f":"VLOOKUP(M51,Macronutrients,12,FALSE)*Q51+VLOOKUP(M52,Macronutrients,12,FALSE)*Q52+VLOOKUP(M53,Macronutrients,12,FALSE)*Q53+VLOOKUP(M54,Macronutrients,12,FALSE)*Q54+VLOOKUP(M55,Macronutrients,12,FALSE)*Q55+VLOOKUP(M56,Macronutrients,12,FALSE)*Q56+VLOOKUP(M59,Micronutrients,12,FALSE)*Q59+VLOOKUP(M60,Micronutrients,12,FALSE)*Q60+VLOOKUP(M61,Micronutrients,12,FALSE)*Q61+VLOOKUP(M62,Micronutrients,12,FALSE)*Q62","v":0},{"$f":"VLOOKUP(M51,Macronutrients,13,FALSE)*Q51+VLOOKUP(M52,Macronutrients,13,FALSE)*Q52+VLOOKUP(M53,Macronutrients,13,FALSE)*Q53+VLOOKUP(M54,Macronutrients,13,FALSE)*Q54+VLOOKUP(M55,Macronutrients,13,FALSE)*Q55+VLOOKUP(M56,Macronutrients,13,FALSE)*Q56+VLOOKUP(M59,Micronutrients,13,FALSE)*Q59+VLOOKUP(M60,Micronutrients,13,FALSE)*Q60+VLOOKUP(M61,Micronutrients,13,FALSE)*Q61+VLOOKUP(M62,Micronutrients,13,FALSE)*Q62","v":0},null,"None",{"$f":"VLOOKUP(Y60,Micronutrients,14,FALSE)","v":0},{"$f":"VLOOKUP(Y60,Micronutrients,18,FALSE)","v":0},{"$f":"VLOOKUP(Y60,Micronutrients,16,FALSE)","v":1},0,{"$f":"VLOOKUP(Y60,Micronutrients,15,FALSE)","v":0},{"$f":"(AC60*VLOOKUP(Y60,Micronutrients,14,FALSE)/AB60)*AA60","v":0},null,{"$f":"VLOOKUP(Y51,Macronutrients,11,FALSE)*AC51+VLOOKUP(Y52,Macronutrients,11,FALSE)*AC52+VLOOKUP(Y53,Macronutrients,11,FALSE)*AC53+VLOOKUP(Y54,Macronutrients,11,FALSE)*AC54+VLOOKUP(Y55,Macronutrients,11,FALSE)*AC55+VLOOKUP(Y56,Macronutrients,11,FALSE)*AC56+VLOOKUP(Y59,Micronutrients,11,FALSE)*AC59+VLOOKUP(Y60,Micronutrients,11,FALSE)*AC60+VLOOKUP(Y61,Micronutrients,11,FALSE)*AC61+VLOOKUP(Y62,Micronutrients,11,FALSE)*AC62","v":0},{"$f":"VLOOKUP(Y51,Macronutrients,12,FALSE)*AC51+VLOOKUP(Y52,Macronutrients,12,FALSE)*AC52+VLOOKUP(Y53,Macronutrients,12,FALSE)*AC53+VLOOKUP(Y54,Macronutrients,12,FALSE)*AC54+VLOOKUP(Y55,Macronutrients,12,FALSE)*AC55+VLOOKUP(Y56,Macronutrients,12,FALSE)*AC56+VLOOKUP(Y59,Micronutrients,12,FALSE)*AC59+VLOOKUP(Y60,Micronutrients,12,FALSE)*AC60+VLOOKUP(Y61,Micronutrients,12,FALSE)*AC61+VLOOKUP(Y62,Micronutrients,12,FALSE)*AC62","v":0},{"$f":"VLOOKUP(Y51,Macronutrients,13,FALSE)*AC51+VLOOKUP(Y52,Macronutrients,13,FALSE)*AC52+VLOOKUP(Y53,Macronutrients,13,FALSE)*AC53+VLOOKUP(Y54,Macronutrients,13,FALSE)*AC54+VLOOKUP(Y55,Macronutrients,13,FALSE)*AC55+VLOOKUP(Y56,Macronutrients,13,FALSE)*AC56+VLOOKUP(Y59,Micronutrients,13,FALSE)*AC59+VLOOKUP(Y60,Micronutrients,13,FALSE)*AC60+VLOOKUP(Y61,Micronutrients,13,FALSE)*AC61+VLOOKUP(Y62,Micronutrients,13,FALSE)*AC62","v":0}]
["None",{"$f":"VLOOKUP($A61,Micronutrients,14,FALSE)","v":0},{"$f":"VLOOKUP(A61,Micronutrients,18,FALSE)","v":0},{"$f":"VLOOKUP(A61,Micronutrients,16,FALSE)","v":1},0,{"$f":"VLOOKUP(A61,Micronutrients,15,FALSE)","v":0},{"$f":"(E61*VLOOKUP(A61,Micronutrients,14,FALSE)/D61)*C61","v":0},null,null,null,null,null,"None",{"$f":"VLOOKUP($M61,Micronutrients,14,FALSE)","v":0},{"$f":"VLOOKUP(M61,Micronutrients,18,FALSE)","v":0},{"$f":"VLOOKUP(M61,Micronutrients,16,FALSE)","v":1},0,{"$f":"VLOOKUP(M61,Micronutrients,15,FALSE)","v":0},{"$f":"(Q61*VLOOKUP(M61,Micronutrients,14,FALSE)/P61)*O61","v":0},null,null,null,null,null,"None",{"$f":"VLOOKUP(Y61,Micronutrients,14,FALSE)","v":0},{"$f":"VLOOKUP(Y61,Micronutrients,18,FALSE)","v":0},{"$f":"VLOOKUP(Y61,Micronutrients,16,FALSE)","v":1},0,{"$f":"VLOOKUP(Y61,Micronutrients,15,FALSE)","v":0},{"$f":"(AC61*VLOOKUP(Y61,Micronutrients,14,FALSE)/AB61)*AA61","v":0}]
["None",{"$f":"VLOOKUP($A62,Micronutrients,14,FALSE)","v":0},{"$f":"VLOOKUP(A62,Micronutrients,18,FALSE)","v":0},{"$f":"VLOOKUP(A62,Micronutrients,16,FALSE)","v":1},0,{"$f":"VLOOKUP(A62,Micronutrients,15,FALSE)","v":0},{"$f":"(E62*VLOOKUP(A62,Micronutrients,14,FALSE)/D62)*C62","v":0},null,null,null,null,null,"None",{"$f":"VLOOKUP($M62,Micronutrients,14,FALSE)","v":0},{"$f":"VLOOKUP(M62,Micronutrients,18,FALSE)","v":0},{"$f":"VLOOKUP(M62,Micronutrients,16,FALSE)","v":1},0,{"$f":"VLOOKUP(M62,Micronutrients,15,FALSE)","v":0},{"$f":"(Q62*VLOOKUP(M62,Micronutrients,14,FALSE)/P62)*O62","v":0},null,null,null,null,null,"None",{"$f":"VLOOKUP(Y62,Micronutrients,14,FALSE)","v":0},{"$f":"VLOOKUP(Y62,Micronutrients,18,FALSE)","v":0},{"$f":"VLOOKUP(Y62,Micronutrients,16,FALSE)","v":1},0,{"$f":"VLOOKUP(Y62,Micronutrients,15,FALSE)","v":0},{"$f":"(AC62*VLOOKUP(Y62,Micronutrients,14,FALSE)/AB62)*AA62","v":0}]
[]
["Nitrogen Stabilizers (drop down menu)",null,null,null,null,null,null,null,null,null,null,null,"Nitrogen Stabilizers (drop down menu)",null,null,null,null,null,null,null,null,null,null,null,"Nitrogen Stabilizers (drop down menu)"]
["None",{"$f":"VLOOKUP(A65,NitrogenStabilizers,14,FALSE)","v":0},{"$f":"VLOOKUP(A65,NitrogenStabilizers,18,FALSE)","v":0},{"$f":"VLOOKUP(A65,NitrogenStabilizers,16,FALSE)","v":1},0,{"$f":"VLOOKUP(A65,NitrogenStabilizers,15,FALSE)","v":0},{"$f":"(E65*VLOOKUP(A65,NitrogenStabilizers,14,FALSE)/D65)*C65","v":0},null,null,null,null,null,"None",{"$f":"VLOOKUP(M65,NitrogenStabilizers,14,FALSE)","v":0},{"$f":"VLOOKUP(M65,NitrogenStabilizers,18,FALSE)","v":0},{"$f":"VLOOKUP(M65,NitrogenStabilizers,16,FALSE)","v":1},0,{"$f":"VLOOKUP(M65,NitrogenStabilizers,15,FALSE)","v":0},{"$f":"(Q65*VLOOKUP(M65,NitrogenStabilizers,14,FALSE)/P65)*O65","v":0},null,null,null,null,null,"None",{"$f":"VLOOKUP(Y65,NitrogenStabilizers,14,FALSE)","v":0},{"$f":"VLOOKUP(Y65,NitrogenStabilizers,18,FALSE)","v":0},{"$f":"VLOOKUP(Y65,NitrogenStabilizers,16,FALSE)","v":1},0,{"$f":"VLOOKUP(Y65,NitrogenStabilizers,15,FALSE)","v":0},{"$f":"(AC65*VLOOKUP(Y65,NitrogenStabilizers,14,FALSE)/AB65)*AA65","v":0}]
["None",{"$f":"VLOOKUP(A66,NitrogenStabilizers,14,FALSE)","v":0},{"$f":"VLOOKUP(A66,NitrogenStabilizers,18,FALSE)","v":0},{"$f":"VLOOKUP(A66,NitrogenStabilizers,16,FALSE)","v":1},0,{"$f":"VLOOKUP(A66,NitrogenStabilizers,15,FALSE)","v":0},{"$f":"(E66*VLOOKUP(A66,NitrogenStabilizers,14,FALSE)/D66)*C66","v":0},null,null,null,"More",null,"None",{"$f":"VLOOKUP(M66,NitrogenStabilizers,14,FALSE)","v":0},{"$f":"VLOOKUP(M66,NitrogenStabilizers,18,FALSE)","v":0},{"$f":"VLOOKUP(M66,NitrogenStabilizers,16,FALSE)","v":1},0,{"$f":"VLOOKUP(M66,NitrogenStabilizers,15,FALSE)","v":0},{"$f":"(Q66*VLOOKUP(M66,NitrogenStabilizers,14,FALSE)/P66)*O66","v":0},null,null,null,"More",null,"None",{"$f":"VLOOKUP(Y66,NitrogenStabilizers,14,FALSE)","v":0},{"$f":"VLOOKUP(Y66,NitrogenStabilizers,18,FALSE)","v":0},{"$f":"VLOOKUP(Y66,NitrogenStabilizers,16,FALSE)","v":1},0,{"$f":"VLOOKUP(Y66,NitrogenStabilizers,15,FALSE)","v":0},{"$f":"(AC66*VLOOKUP(Y66,NitrogenStabilizers,14,FALSE)/AB66)*AA66","v":0},null,null,null,"More"]
["3rd Application Fertilizer Cost/Acre",null,null,null,null,null,{"$f":"SUM(G51:G66)","v":0},null,null,null,"Below",null,"3rd Application Fertilizer Cost/Acre",null,null,null,null,null,{"$f":"SUM(S51:S66)","v":0},null,null,null,"Below",null,"3rd Application Fertilizer Cost/Acre",null,null,null,null,null,{"$f":"SUM(AE51:AE66)","v":0},null,null,null,"Below"]
[null,null,null,null,null,null,null,null,null,null,"¯",null,null,null,null,null,null,null,null,null,null,null,"¯",null,null,null,null,null,null,null,null,null,null,null,"¯"]
["4th Application (i.e., Side-Dress or Broadcast or Fertigation)",null,null,null,null,null,null,null,null,null,null,null,"4th Application (i.e., Side-Dress or Broadcast or Fertigation)",null,null,null,null,null,null,null,null,null,null,null,"4th Application (i.e., Side-Dress or Broadcast or Fertigation)"]
["Fertilizer Source","Purchase Units","Package Price (Gals, Lbs, etc.)","Units/Pkg","Rate/Acre","Units","Cost",null,null,null,null,null,"Fertilizer Source","Purchase Units","Package Price (Gals, Lbs, etc.)","Units/Pkg","Rate/Acre","Units","Cost",null,null,null,null,null,"Fertilizer Source","Purchase Units","Package Price (Gals, Lbs, etc.)","Units/Pkg","Rate/Acre","Units","Cost"]
["Macronutrients (drop down menu)",null,null,null,"(Enter Below)",null,null,null,"N","P","K",null,"Macronutrients (drop down menu)",null,null,null,"(Enter Below)",null,null,null,"N","P","K",null,"Macronutrients (drop down menu)",null,null,null,"(Enter Below)",null,null,null,"N","P","K"]
["None",{"$f":"VLOOKUP(A72,Macronutrients,14,FALSE)","v":0},{"$f":"VLOOKUP(A72,Macronutrients,18,FALSE)","v":0},{"$f":"VLOOKUP(A72,Macronutrients,16,FALSE)","v":1},0,{"$f":"VLOOKUP(A72,Macronutrients,15,FALSE)","v":0},{"$f":"(E72*VLOOKUP(A72,Macronutrients,14,FALSE)/D72)*C72","v":0},null,{"$f":"VLOOKUP(A72,Macronutrients,2,FALSE)*E72+VLOOKUP(A73,Macronutrients,2,FALSE)*E73+VLOOKUP(A74,Macronutrients,2,FALSE)*E74+VLOOKUP(A75,Macronutrients,2,FALSE)*E75+VLOOKUP(A76,Macronutrients,2,FALSE)*E76+VLOOKUP(A77,Macronutrients,2,FALSE)*E77+VLOOKUP(A80,Micronutrients,2,FALSE)*E80+VLOOKUP(A81,Micronutrients,2,FALSE)*E81+VLOOKUP(A82,Micronutrients,2,FALSE)*E82+VLOOKUP(A83,Micronutrients,2,FALSE)*E83","v":0},{"$f":"VLOOKUP(A72,Macronutrients,3,FALSE)*E72+VLOOKUP(A73,Macronutrients,3,FALSE)*E73+VLOOKUP(A74,Macronutrients,3,FALSE)*E74+VLOOKUP(A75,Macronutrients,3,FALSE)*E75+VLOOKUP(A76,Macronutrients,3,FALSE)*E76+VLOOKUP(A77,Macronutrients,3,FALSE)*E77+VLOOKUP(A80,Micronutrients,3,FALSE)*E80+VLOOKUP(A81,Micronutrients,3,FALSE)*E81+VLOOKUP(A82,Micronutrients,3,FALSE)*E82+VLOOKUP(A83,Micronutrients,3,FALSE)*E83","v":0},{"$f":"VLOOKUP(A72,Macronutrients,4,FALSE)*E72+VLOOKUP(A73,Macronutrients,4,FALSE)*E73+VLOOKUP(A74,Macronutrients,4,FALSE)*E74+VLOOKUP(A75,Macronutrients,4,FALSE)*E75+VLOOKUP(A76,Macronutrients,4,FALSE)*E76+VLOOKUP(A77,Macronutrients,4,FALSE)*E77+VLOOKUP(A80,Micronutrients,4,FALSE)*E80+VLOOKUP(A81,Micronutrients,4,FALSE)*E81+VLOOKUP(A82,Micronutrients,4,FALSE)*E82+VLOOKUP(A83,Micronutrients,4,FALSE)*E83","v":0},null,"None",{"$f":"VLOOKUP(M72,Macronutrients,14,FALSE)","v":0},{"$f":"VLOOKUP(M72,Macronutrients,18,FALSE)","v":0},{"$f":"VLOOKUP(M72,Macronutrients,16,FALSE)","v":1},0,{"$f":"VLOOKUP(M72,Macronutrients,15,FALSE)","v":0},{"$f":"(Q72*VLOOKUP(M72,Macronutrients,14,FALSE)/P72)*O72","v":0},null,{"$f":"VLOOKUP(M72,Macronutrients,2,FALSE)*Q72+VLOOKUP(M73,Macronutrients,2,FALSE)*Q73+VLOOKUP(M74,Macronutrients,2,FALSE)*Q74+VLOOKUP(M75,Macronutrients,2,FALSE)*Q75+VLOOKUP(M76,Macronutrients,2,FALSE)*Q76+VLOOKUP(M77,Macronutrients,2,FALSE)*Q77+VLOOKUP(M80,Micronutrients,2,FALSE)*Q80+VLOOKUP(M81,Micronutrients,2,FALSE)*Q81+VLOOKUP(M82,Micronutrients,2,FALSE)*Q82+VLOOKUP(M83,Micronutrients,2,FALSE)*Q83","v":0},{"$f":"VLOOKUP(M72,Macronutrients,3,FALSE)*Q72+VLOOKUP(M73,Macronutrients,3,FALSE)*Q73+VLOOKUP(M74,Macronutrients,3,FALSE)*Q74+VLOOKUP(M75,Macronutrients,3,FALSE)*Q75+VLOOKUP(M76,Macronutrients,3,FALSE)*Q76+VLOOKUP(M77,Macronutrients,3,FALSE)*Q77+VLOOKUP(M80,Micronutrients,3,FALSE)*Q80+VLOOKUP(M81,Micronutrients,3,FALSE)*Q81+VLOOKUP(M82,Micronutrients,3,FALSE)*Q82+VLOOKUP(M83,Micronutrients,3,FALSE)*Q83","v":0},{"$f":"VLOOKUP(M72,Macronutrients,4,FALSE)*Q72+VLOOKUP(M73,Macronutrients,4,FALSE)*Q73+VLOOKUP(M74,Macronutrients,4,FALSE)*Q74+VLOOKUP(M75,Macronutrients,4,FALSE)*Q75+VLOOKUP(M76,Macronutrients,4,FALSE)*Q76+VLOOKUP(M77,Macronutrients,4,FALSE)*Q77+VLOOKUP(M80,Micronutrients,4,FALSE)*Q80+VLOOKUP(M81,Micronutrients,4,FALSE)*Q81+VLOOKUP(M82,Micronutrients,4,FALSE)*Q82+VLOOKUP(M83,Micronutrients,4,FALSE)*Q83","v":0},null,"None",{"$f":"VLOOKUP(Y72,Macronutrients,14,FALSE)","v":0},{"$f":"VLOOKUP(Y72,Macronutrients,18,FALSE)","v":0},{"$f":"VLOOKUP(Y72,Macronutrients,16,FALSE)","v":1},0,{"$f":"VLOOKUP(Y72,Macronutrients,15,FALSE)","v":0},{"$f":"(AC72*VLOOKUP(Y72,Macronutrients,14,FALSE)/AB72)*AA72","v":0},null,{"$f":"VLOOKUP(Y72,Macronutrients,2,FALSE)*AC72+VLOOKUP(Y73,Macronutrients,2,FALSE)*AC73+VLOOKUP(Y74,Macronutrients,2,FALSE)*AC74+VLOOKUP(Y75,Macronutrients,2,FALSE)*AC75+VLOOKUP(Y76,Macronutrients,2,FALSE)*AC76+VLOOKUP(Y77,Macronutrients,2,FALSE)*AC77+VLOOKUP(Y80,Micronutrients,2,FALSE)*AC80+VLOOKUP(Y81,Micronutrients,2,FALSE)*AC81+VLOOKUP(Y82,Micronutrients,2,FALSE)*AC82+VLOOKUP(Y83,Micronutrients,2,FALSE)*AC83","v":0},{"$f":"VLOOKUP(Y72,Macronutrients,3,FALSE)*AC72+VLOOKUP(Y73,Macronutrients,3,FALSE)*AC73+VLOOKUP(Y74,Macronutrients,3,FALSE)*AC74+VLOOKUP(Y75,Macronutrients,3,FALSE)*AC75+VLOOKUP(Y76,Macronutrients,3,FALSE)*AC76+VLOOKUP(Y77,Macronutrients,3,FALSE)*AC77+VLOOKUP(Y80,Micronutrients,3,FALSE)*AC80+VLOOKUP(Y81,Micronutrients,3,FALSE)*AC81+VLOOKUP(Y82,Micronutrients,3,FALSE)*AC82+VLOOKUP(Y83,Micronutrients,3,FALSE)*AC83","v":0},{"$f":"VLOOKUP(Y72,Macronutrients,4,FALSE)*AC72+VLOOKUP(Y73,Macronutrients,4,FALSE)*AC73+VLOOKUP(Y74,Macronutrients,4,FALSE)*AC74+VLOOKUP(Y75,Macronutrients,4,FALSE)*AC75+VLOOKUP(Y76,Macronutrients,4,FALSE)*AC76+VLOOKUP(Y77,Macronutrients,4,FALSE)*AC77+VLOOKUP(Y80,Micronutrients,4,FALSE)*AC80+VLOOKUP(Y81,Micronutrients,4,FALSE)*AC81+VLOOKUP(Y82,Micronutrients,4,FALSE)*AC82+VLOOKUP(Y83,Micronutrients,4,FALSE)*AC83","v":0}]
["None",0,0,1,0,0,0,null,null,null,null,null,"None",0,0,1,0,0,0,null,null,null,null,null,"None",0,0,1,0,0,0]
["None",0,0,1,0,0,0,null,"S","Ca","Mg",null,"None",0,0,1,0,0,0,null,"S","Ca","Mg",null,"None",0,0,1,0,0,0,null,"S","Ca","Mg"]
["None",0,0,1,0,0,0,null,{"$f":"VLOOKUP(A72,Macronutrients,5,FALSE)*E72+VLOOKUP(A73,Macronutrients,5,FALSE)*E73+VLOOKUP(A74,Macronutrients,5,FALSE)*E74+VLOOKUP(A75,Macronutrients,5,FALSE)*E75+VLOOKUP(A76,Macronutrients,5,FALSE)*E76+VLOOKUP(A77,Macronutrients,5,FALSE)*E77+VLOOKUP(A80,Micronutrients,5,FALSE)*E80+VLOOKUP(A81,Micronutrients,5,FALSE)*E81+VLOOKUP(A82,Micronutrients,5,FALSE)*E82+VLOOKUP(A83,Micronutrients,5,FALSE)*E83","v":0},{"$f":"VLOOKUP(A72,Macronutrients,7,FALSE)*E72+VLOOKUP(A73,Macronutrients,7,FALSE)*E73+VLOOKUP(A74,Macronutrients,7,FALSE)*E74+VLOOKUP(A75,Macronutrients,7,FALSE)*E75+VLOOKUP(A76,Macronutrients,7,FALSE)*E76+VLOOKUP(A77,Macronutrients,7,FALSE)*E77+VLOOKUP(A80,Micronutrients,7,FALSE)*E80+VLOOKUP(A81,Micronutrients,7,FALSE)*E81+VLOOKUP(A82,Micronutrients,7,FALSE)*E82+VLOOKUP(A83,Micronutrients,7,FALSE)*E83","v":0},{"$f":"VLOOKUP($A72,Macronutrients,6,FALSE)*$E$6+VLOOKUP($A73,Macronutrients,6,FALSE)*$E$7+VLOOKUP($A74,Macronutrients,6,FALSE)*$E$8+VLOOKUP($A75,Macronutrients,6,FALSE)*$E$9+VLOOKUP($A76,Macronutrients,6,FALSE)*$E$10+VLOOKUP($A77,Macronutrients,6,FALSE)*$E$11+VLOOKUP($A80,Micronutrients,6,FALSE)*$E$14+VLOOKUP($A81,Micronutrients,6,FALSE)*E81+VLOOKUP($A82,Micronutrients,6,FALSE)*$E$16+VLOOKUP($A83,Micronutrients,6,FALSE)*$E$17","v":0},null,"None",0,0,1,0,0,0,null,{"$f":"VLOOKUP(M72,Macronutrients,5,FALSE)*Q72+VLOOKUP(M73,Macronutrients,5,FALSE)*Q73+VLOOKUP(M74,Macronutrients,5,FALSE)*Q74+VLOOKUP(M75,Macronutrients,5,FALSE)*Q75+VLOOKUP(M76,Macronutrients,5,FALSE)*Q76+VLOOKUP(M77,Macronutrients,5,FALSE)*Q77+VLOOKUP(M80,Micronutrients,5,FALSE)*Q80+VLOOKUP(M81,Micronutrients,5,FALSE)*Q81+VLOOKUP(M82,Micronutrients,5,FALSE)*Q82+VLOOKUP(M83,Micronutrients,5,FALSE)*Q83","v":0},{"$f":"VLOOKUP(M72,Macronutrients,7,FALSE)*Q72+VLOOKUP(M73,Macronutrients,7,FALSE)*Q73+VLOOKUP(M74,Macronutrients,7,FALSE)*Q74+VLOOKUP(M75,Macronutrients,7,FALSE)*Q75+VLOOKUP(M76,Macronutrients,7,FALSE)*Q76+VLOOKUP(M77,Macronutrients,7,FALSE)*Q77+VLOOKUP(M80,Micronutrients,7,FALSE)*Q80+VLOOKUP(M81,Micronutrients,7,FALSE)*Q81+VLOOKUP(M82,Micronutrients,7,FALSE)*Q82+VLOOKUP(M83,Micronutrients,7,FALSE)*Q83","v":0},{"$f":"VLOOKUP($A72,Macronutrients,6,FALSE)*$E$6+VLOOKUP($A73,Macronutrients,6,FALSE)*$E$7+VLOOKUP($A74,Macronutrients,6,FALSE)*$E$8+VLOOKUP($A75,Macronutrients,6,FALSE)*$E$9+VLOOKUP($A76,Macronutrients,6,FALSE)*$E$10+VLOOKUP($A77,Macronutrients,6,FALSE)*$E$11+VLOOKUP($A80,Micronutrients,6,FALSE)*$E$14+VLOOKUP($A81,Micronutrients,6,FALSE)*Q81+VLOOKUP($A82,Micronutrients,6,FALSE)*$E$16+VLOOKUP($A83,Micronutrients,6,FALSE)*$E$17","v":0},null,"None",0,0,1,0,0,0,null,{"$f":"VLOOKUP(Y72,Macronutrients,5,FALSE)*AC72+VLOOKUP(Y73,Macronutrients,5,FALSE)*AC73+VLOOKUP(Y74,Macronutrients,5,FALSE)*AC74+VLOOKUP(Y75,Macronutrients,5,FALSE)*AC75+VLOOKUP(Y76,Macronutrients,5,FALSE)*AC76+VLOOKUP(Y77,Macronutrients,5,FALSE)*AC77+VLOOKUP(Y80,Micronutrients,5,FALSE)*AC80+VLOOKUP(Y81,Micronutrients,5,FALSE)*AC81+VLOOKUP(Y82,Micronutrients,5,FALSE)*AC82+VLOOKUP(Y83,Micronutrients,5,FALSE)*AC83","v":0},{"$f":"VLOOKUP(Y72,Macronutrients,7,FALSE)*AC72+VLOOKUP(Y73,Macronutrients,7,FALSE)*AC73+VLOOKUP(Y74,Macronutrients,7,FALSE)*AC74+VLOOKUP(Y75,Macronutrients,7,FALSE)*AC75+VLOOKUP(Y76,Macronutrients,7,FALSE)*AC76+VLOOKUP(Y77,Macronutrients,7,FALSE)*AC77+VLOOKUP(Y80,Micronutrients,7,FALSE)*AC80+VLOOKUP(Y81,Micronutrients,7,FALSE)*AC81+VLOOKUP(Y82,Micronutrients,7,FALSE)*AC82+VLOOKUP(Y83,Micronutrients,7,FALSE)*AC83","v":0},{"$f":"VLOOKUP($A72,Macronutrients,6,FALSE)*$E$6+VLOOKUP($A73,Macronutrients,6,FALSE)*$E$7+VLOOKUP($A74,Macronutrients,6,FALSE)*$E$8+VLOOKUP($A75,Macronutrients,6,FALSE)*$E$9+VLOOKUP($A76,Macronutrients,6,FALSE)*$E$10+VLOOKUP($A77,Macronutrients,6,FALSE)*$E$11+VLOOKUP($A80,Micronutrients,6,FALSE)*$E$14+VLOOKUP($A81,Micronutrients,6,FALSE)*AC81+VLOOKUP($A82,Micronutrients,6,FALSE)*$E$16+VLOOKUP($A83,Micronutrients,6,FALSE)*$E$17","v":0}]
["None",0,0,1,0,0,0,null,null,null,null,null,"None",0,0,1,0,0,0,null,null,null,null,null,"None",0,0,1,0,0,0]
["None",0,0,1,0,0,0,null,"Z","B","Mn",null,"None",0,0,1,0,0,0,null,"Z","B","Mn",null,"None",0,0,1,0,0,0,null,"Z","B","Mn"]
[null,null,null,null,null,null,null,null,{"$f":"VLOOKUP(A72,Macronutrients,8,FALSE)*E72+VLOOKUP(A73,Macronutrients,8,FALSE)*E73+VLOOKUP(A74,Macronutrients,8,FALSE)*E74+VLOOKUP(A75,Macronutrients,8,FALSE)*E75+VLOOKUP(A76,Macronutrients,8,FALSE)*E76+VLOOKUP(A77,Macronutrients,8,FALSE)*E77+VLOOKUP(A80,Micronutrients,8,FALSE)*E80+VLOOKUP(A81,Micronutrients,8,FALSE)*E81+VLOOKUP(A82,Micronutrients,8,FALSE)*E82+VLOOKUP(A83,Micronutrients,8,FALSE)*E83","v":0},{"$f":"VLOOKUP(A72,Macronutrients,9,FALSE)*E72+VLOOKUP(A73,Macronutrients,9,FALSE)*E73+VLOOKUP(A74,Macronutrients,9,FALSE)*E74+VLOOKUP(A75,Macronutrients,9,FALSE)*E75+VLOOKUP(A76,Macronutrients,9,FALSE)*E76+VLOOKUP(A77,Macronutrients,9,FALSE)*E77+VLOOKUP(A80,Micronutrients,9,FALSE)*E80+VLOOKUP(A81,Micronutrients,9,FALSE)*E81+VLOOKUP(A82,Micronutrients,9,FALSE)*E82+VLOOKUP(A83,Micronutrients,9,FALSE)*E83","v":0},{"$f":"VLOOKUP(A72,Macronutrients,10,FALSE)*E72+VLOOKUP(A73,Macronutrients,10,FALSE)*E73+VLOOKUP(A74,Macronutrients,10,FALSE)*E74+VLOOKUP(A75,Macronutrients,10,FALSE)*E75+VLOOKUP(A76,Macronutrients,10,FALSE)*E76+VLOOKUP(A77,Macronutrients,10,FALSE)*E77+VLOOKUP(A80,Micronutrients,10,FALSE)*E80+VLOOKUP(A81,Micronutrients,10,FALSE)*E81+VLOOKUP(A82,Micronutrients,10,FALSE)*E82+VLOOKUP(A83,Micronutrients,10,FALSE)*E83","v":0},null,null,null,null,null,null,null,null,null,{"$f":"VLOOKUP(M72,Macronutrients,8,FALSE)*Q72+VLOOKUP(M73,Macronutrients,8,FALSE)*Q73+VLOOKUP(M74,Macronutrients,8,FALSE)*Q74+VLOOKUP(M75,Macronutrients,8,FALSE)*Q75+VLOOKUP(M76,Macronutrients,8,FALSE)*Q76+VLOOKUP(M77,Macronutrients,8,FALSE)*Q77+VLOOKUP(M80,Micronutrients,8,FALSE)*Q80+VLOOKUP(M81,Micronutrients,8,FALSE)*Q81+VLOOKUP(M82,Micronutrients,8,FALSE)*Q82+VLOOKUP(M83,Micronutrients,8,FALSE)*Q83","v":0},{"$f":"VLOOKUP(M72,Macronutrients,9,FALSE)*Q72+VLOOKUP(M73,Macronutrients,9,FALSE)*Q73+VLOOKUP(M74,Macronutrients,9,FALSE)*Q74+VLOOKUP(M75,Macronutrients,9,FALSE)*Q75+VLOOKUP(M76,Macronutrients,9,FALSE)*Q76+VLOOKUP(M77,Macronutrients,9,FALSE)*Q77+VLOOKUP(M80,Micronutrients,9,FALSE)*Q80+VLOOKUP(M81,Micronutrients,9,FALSE)*Q81+VLOOKUP(M82,Micronutrients,9,FALSE)*Q82+VLOOKUP(M83,Micronutrients,9,FALSE)*Q83","v":0},{"$f":"VLOOKUP(M72,Macronutrients,10,FALSE)*Q72+VLOOKUP(M73,Macronutrients,10,FALSE)*Q73+VLOOKUP(M74,Macronutrients,10,FALSE)*Q74+VLOOKUP(M75,Macronutrients,10,FALSE)*Q75+VLOOKUP(M76,Macronutrients,10,FALSE)*Q76+VLOOKUP(M77,Macronutrients,10,FALSE)*Q77+VLOOKUP(M80,Micronutrients,10,FALSE)*Q80+VLOOKUP(M81,Micronutrients,10,FALSE)*Q81+VLOOKUP(M82,Micronutrients,10,FALSE)*Q82+VLOOKUP(M83,Micronutrients,10,FALSE)*Q83","v":0},null,null,null,null,null,null,null,null,null,{"$f":"VLOOKUP(Y72,Macronutrients,8,FALSE)*AC72+VLOOKUP(Y73,Macronutrients,8,FALSE)*AC73+VLOOKUP(Y74,Macronutrients,8,FALSE)*AC74+VLOOKUP(Y75,Macronutrients,8,FALSE)*AC75+VLOOKUP(Y76,Macronutrients,8,FALSE)*AC76+VLOOKUP(Y77,Macronutrients,8,FALSE)*AC77+VLOOKUP(Y80,Micronutrients,8,FALSE)*AC80+VLOOKUP(Y81,Micronutrients,8,FALSE)*AC81+VLOOKUP(Y82,Micronutrients,8,FALSE)*AC82+VLOOKUP(Y83,Micronutrients,8,FALSE)*AC83","v":0},{"$f":"VLOOKUP(Y72,Macronutrients,9,FALSE)*AC72+VLOOKUP(Y73,Macronutrients,9,FALSE)*AC73+VLOOKUP(Y74,Macronutrients,9,FALSE)*AC74+VLOOKUP(Y75,Macronutrients,9,FALSE)*AC75+VLOOKUP(Y76,Macronutrients,9,FALSE)*AC76+VLOOKUP(Y77,Macronutrients,9,FALSE)*AC77+VLOOKUP(Y80,Micronutrients,9,FALSE)*AC80+VLOOKUP(Y81,Micronutrients,9,FALSE)*AC81+VLOOKUP(Y82,Micronutrients,9,FALSE)*AC82+VLOOKUP(Y83,Micronutrients,9,FALSE)*AC83","v":0},{"$f":"VLOOKUP(Y72,Macronutrients,10,FALSE)*AC72+VLOOKUP(Y73,Macronutrients,10,FALSE)*AC73+VLOOKUP(Y74,Macronutrients,10,FALSE)*AC74+VLOOKUP(Y75,Macronutrients,10,FALSE)*AC75+VLOOKUP(Y76,Macronutrients,10,FALSE)*AC76+VLOOKUP(Y77,Macronutrients,10,FALSE)*AC77+VLOOKUP(Y80,Micronutrients,10,FALSE)*AC80+VLOOKUP(Y81,Micronutrients,10,FALSE)*AC81+VLOOKUP(Y82,Micronutrients,10,FALSE)*AC82+VLOOKUP(Y83,Micronutrients,10,FALSE)*AC83","v":0}]
["Micronutrients (drop down menu)",null,null,null,null,null,null,null,null,null,null,null,"Micronutrients (drop down menu)",null,null,null,null,null,null,null,null,null,null,null,"Micronutrients (drop down menu)"]
["None",{"$f":"VLOOKUP($A80,Micronutrients,14,FALSE)","v":0},{"$f":"VLOOKUP(A80,Micronutrients,18,FALSE)","v":0},{"$f":"VLOOKUP(A80,Micronutrients,16,FALSE)","v":1},0,{"$f":"VLOOKUP(A80,Micronutrients,15,FALSE)","v":0},{"$f":"(E80*VLOOKUP(A80,Micronutrients,14,FALSE)/D80)*C80","v":0},null,"Cu","Mo","Fe",null,"None",{"$f":"VLOOKUP($M80,Micronutrients,14,FALSE)","v":0},{"$f":"VLOOKUP(M80,Micronutrients,18,FALSE)","v":0},{"$f":"VLOOKUP(M80,Micronutrients,16,FALSE)","v":1},0,{"$f":"VLOOKUP(M80,Micronutrients,15,FALSE)","v":0},{"$f":"(Q80*VLOOKUP(M80,Micronutrients,14,FALSE)/P80)*O80","v":0},null,"Cu","Mo","Fe",null,"None",{"$f":"VLOOKUP(Y80,Micronutrients,14,FALSE)","v":0},{"$f":"VLOOKUP(Y80,Micronutrients,18,FALSE)","v":0},{"$f":"VLOOKUP(Y80,Micronutrients,16,FALSE)","v":1},0,{"$f":"VLOOKUP(Y80,Micronutrients,15,FALSE)","v":0},{"$f":"(AC80*VLOOKUP(Y80,Micronutrients,14,FALSE)/AB80)*AA80","v":0},null,"Cu","Mo","Fe"]
["None",{"$f":"VLOOKUP($A81,Micronutrients,14,FALSE)","v":0},{"$f":"VLOOKUP(A81,Micronutrients,18,FALSE)","v":0},{"$f":"VLOOKUP(A81,Micronutrients,16,FALSE)","v":1},0,{"$f":"VLOOKUP(A81,Micronutrients,15,FALSE)","v":0},{"$f":"(E81*VLOOKUP(A81,Micronutrients,14,FALSE)/D81)*C81","v":0},null,{"$f":"VLOOKUP(A72,Macronutrients,11,FALSE)*E72+VLOOKUP(A73,Macronutrients,11,FALSE)*E73+VLOOKUP(A74,Macronutrients,11,FALSE)*E74+VLOOKUP(A75,Macronutrients,11,FALSE)*E75+VLOOKUP(A76,Macronutrients,11,FALSE)*E76+VLOOKUP(A77,Macronutrients,11,FALSE)*E77+VLOOKUP(A80,Micronutrients,11,FALSE)*E80+VLOOKUP(A81,Micronutrients,11,FALSE)*E81+VLOOKUP(A82,Micronutrients,11,FALSE)*E82+VLOOKUP(A83,Micronutrients,11,FALSE)*E83","v":0},{"$f":"VLOOKUP(A72,Macronutrients,12,FALSE)*E72+VLOOKUP(A73,Macronutrients,12,FALSE)*E73+VLOOKUP(A74,Macronutrients,12,FALSE)*E74+VLOOKUP(A75,Macronutrients,12,FALSE)*E75+VLOOKUP(A76,Macronutrients,12,FALSE)*E76+VLOOKUP(A77,Macronutrients,12,FALSE)*E77+VLOOKUP(A80,Micronutrients,12,FALSE)*E80+VLOOKUP(A81,Micronutrients,12,FALSE)*E81+VLOOKUP(A82,Micronutrients,12,FALSE)*E82+VLOOKUP(A83,Micronutrients,12,FALSE)*E83","v":0},{"$f":"VLOOKUP(A72,Macronutrients,13,FALSE)*E72+VLOOKUP(A73,Macronutrients,13,FALSE)*E73+VLOOKUP(A74,Macronutrients,13,FALSE)*E74+VLOOKUP(A75,Macronutrients,13,FALSE)*E75+VLOOKUP(A76,Macronutrients,13,FALSE)*E76+VLOOKUP(A77,Macronutrients,13,FALSE)*E77+VLOOKUP(A80,Micronutrients,13,FALSE)*E80+VLOOKUP(A81,Micronutrients,13,FALSE)*E81+VLOOKUP(A82,Micronutrients,13,FALSE)*E82+VLOOKUP(A83,Micronutrients,13,FALSE)*E83","v":0},null,"None",{"$f":"VLOOKUP($M81,Micronutrients,14,FALSE)","v":0},{"$f":"VLOOKUP(M81,Micronutrients,18,FALSE)","v":0},{"$f":"VLOOKUP(M81,Micronutrients,16,FALSE)","v":1},0,{"$f":"VLOOKUP(M81,Micronutrients,15,FALSE)","v":0},{"$f":"(Q81*VLOOKUP(M81,Micronutrients,14,FALSE)/P81)*O81","v":0},null,{"$f":"VLOOKUP(M72,Macronutrients,11,FALSE)*Q72+VLOOKUP(M73,Macronutrients,11,FALSE)*Q73+VLOOKUP(M74,Macronutrients,11,FALSE)*Q74+VLOOKUP(M75,Macronutrients,11,FALSE)*Q75+VLOOKUP(M76,Macronutrients,11,FALSE)*Q76+VLOOKUP(M77,Macronutrients,11,FALSE)*Q77+VLOOKUP(M80,Micronutrients,11,FALSE)*Q80+VLOOKUP(M81,Micronutrients,11,FALSE)*Q81+VLOOKUP(M82,Micronutrients,11,FALSE)*Q82+VLOOKUP(M83,Micronutrients,11,FALSE)*Q83","v":0},{"$f":"VLOOKUP(M72,Macronutrients,12,FALSE)*Q72+VLOOKUP(M73,Macronutrients,12,FALSE)*Q73+VLOOKUP(M74,Macronutrients,12,FALSE)*Q74+VLOOKUP(M75,Macronutrients,12,FALSE)*Q75+VLOOKUP(M76,Macronutrients,12,FALSE)*Q76+VLOOKUP(M77,Macronutrients,12,FALSE)*Q77+VLOOKUP(M80,Micronutrients,12,FALSE)*Q80+VLOOKUP(M81,Micronutrients,12,FALSE)*Q81+VLOOKUP(M82,Micronutrients,12,FALSE)*Q82+VLOOKUP(M83,Micronutrients,12,FALSE)*Q83","v":0},{"$f":"VLOOKUP(M72,Macronutrients,13,FALSE)*Q72+VLOOKUP(M73,Macronutrients,13,FALSE)*Q73+VLOOKUP(M74,Macronutrients,13,FALSE)*Q74+VLOOKUP(M75,Macronutrients,13,FALSE)*Q75+VLOOKUP(M76,Macronutrients,13,FALSE)*Q76+VLOOKUP(M77,Macronutrients,13,FALSE)*Q77+VLOOKUP(M80,Micronutrients,13,FALSE)*Q80+VLOOKUP(M81,Micronutrients,13,FALSE)*Q81+VLOOKUP(M82,Micronutrients,13,FALSE)*Q82+VLOOKUP(M83,Micronutrients,13,FALSE)*Q83","v":0},null,"None",{"$f":"VLOOKUP(Y81,Micronutrients,14,FALSE)","v":0},{"$f":"VLOOKUP(Y81,Micronutrients,18,FALSE)","v":0},{"$f":"VLOOKUP(Y81,Micronutrients,16,FALSE)","v":1},0,{"$f":"VLOOKUP(Y81,Micronutrients,15,FALSE)","v":0},{"$f":"(AC81*VLOOKUP(Y81,Micronutrients,14,FALSE)/AB81)*AA81","v":0},null,{"$f":"VLOOKUP(Y72,Macronutrients,11,FALSE)*AC72+VLOOKUP(Y73,Macronutrients,11,FALSE)*AC73+VLOOKUP(Y74,Macronutrients,11,FALSE)*AC74+VLOOKUP(Y75,Macronutrients,11,FALSE)*AC75+VLOOKUP(Y76,Macronutrients,11,FALSE)*AC76+VLOOKUP(Y77,Macronutrients,11,FALSE)*AC77+VLOOKUP(Y80,Micronutrients,11,FALSE)*AC80+VLOOKUP(Y81,Micronutrients,11,FALSE)*AC81+VLOOKUP(Y82,Micronutrients,11,FALSE)*AC82+VLOOKUP(Y83,Micronutrients,11,FALSE)*AC83","v":0},{"$f":"VLOOKUP(Y72,Macronutrients,12,FALSE)*AC72+VLOOKUP(Y73,Macronutrients,12,FALSE)*AC73+VLOOKUP(Y74,Macronutrients,12,FALSE)*AC74+VLOOKUP(Y75,Macronutrients,12,FALSE)*AC75+VLOOKUP(Y76,Macronutrients,12,FALSE)*AC76+VLOOKUP(Y77,Macronutrients,12,FALSE)*AC77+VLOOKUP(Y80,Micronutrients,12,FALSE)*AC80+VLOOKUP(Y81,Micronutrients,12,FALSE)*AC81+VLOOKUP(Y82,Micronutrients,12,FALSE)*AC82+VLOOKUP(Y83,Micronutrients,12,FALSE)*AC83","v":0},{"$f":"VLOOKUP(Y72,Macronutrients,13,FALSE)*AC72+VLOOKUP(Y73,Macronutrients,13,FALSE)*AC73+VLOOKUP(Y74,Macronutrients,13,FALSE)*AC74+VLOOKUP(Y75,Macronutrients,13,FALSE)*AC75+VLOOKUP(Y76,Macronutrients,13,FALSE)*AC76+VLOOKUP(Y77,Macronutrients,13,FALSE)*AC77+VLOOKUP(Y80,Micronutrients,13,FALSE)*AC80+VLOOKUP(Y81,Micronutrients,13,FALSE)*AC81+VLOOKUP(Y82,Micronutrients,13,FALSE)*AC82+VLOOKUP(Y83,Micronutrients,13,FALSE)*AC83","v":0}]
["None",{"$f":"VLOOKUP($A82,Micronutrients,14,FALSE)","v":0},{"$f":"VLOOKUP(A82,Micronutrients,18,FALSE)","v":0},{"$f":"VLOOKUP(A82,Micronutrients,16,FALSE)","v":1},0,{"$f":"VLOOKUP(A82,Micronutrients,15,FALSE)","v":0},{"$f":"(E82*VLOOKUP(A82,Micronutrients,14,FALSE)/D82)*C82","v":0},null,null,null,null,null,"None",{"$f":"VLOOKUP($M82,Micronutrients,14,FALSE)","v":0},{"$f":"VLOOKUP(M82,Micronutrients,18,FALSE)","v":0},{"$f":"VLOOKUP(M82,Micronutrients,16,FALSE)","v":1},0,{"$f":"VLOOKUP(M82,Micronutrients,15,FALSE)","v":0},{"$f":"(Q82*VLOOKUP(M82,Micronutrients,14,FALSE)/P82)*O82","v":0},null,null,null,null,null,"None",{"$f":"VLOOKUP(Y82,Micronutrients,14,FALSE)","v":0},{"$f":"VLOOKUP(Y82,Micronutrients,18,FALSE)","v":0},{"$f":"VLOOKUP(Y82,Micronutrients,16,FALSE)","v":1},0,{"$f":"VLOOKUP(Y82,Micronutrients,15,FALSE)","v":0},{"$f":"(AC82*VLOOKUP(Y82,Micronutrients,14,FALSE)/AB82)*AA82","v":0}]
["None",{"$f":"VLOOKUP($A83,Micronutrients,14,FALSE)","v":0},{"$f":"VLOOKUP(A83,Micronutrients,18,FALSE)","v":0},{"$f":"VLOOKUP(A83,Micronutrients,16,FALSE)","v":1},0,{"$f":"VLOOKUP(A83,Micronutrients,15,FALSE)","v":0},{"$f":"(E83*VLOOKUP(A83,Micronutrients,14,FALSE)/D83)*C83","v":0},null,null,null,null,null,"None",{"$f":"VLOOKUP($M83,Micronutrients,14,FALSE)","v":0},{"$f":"VLOOKUP(M83,Micronutrients,18,FALSE)","v":0},{"$f":"VLOOKUP(M83,Micronutrients,16,FALSE)","v":1},0,{"$f":"VLOOKUP(M83,Micronutrients,15,FALSE)","v":0},{"$f":"(Q83*VLOOKUP(M83,Micronutrients,14,FALSE)/P83)*O83","v":0},null,null,null,null,null,"None",{"$f":"VLOOKUP(Y83,Micronutrients,14,FALSE)","v":0},{"$f":"VLOOKUP(Y83,Micronutrients,18,FALSE)","v":0},{"$f":"VLOOKUP(Y83,Micronutrients,16,FALSE)","v":1},0,{"$f":"VLOOKUP(Y83,Micronutrients,15,FALSE)","v":0},{"$f":"(AC83*VLOOKUP(Y83,Micronutrients,14,FALSE)/AB83)*AA83","v":0}]
[]
["Nitrogen Stabilizers (drop down menu)",null,null,null,null,null,null,null,null,null,null,null,"Nitrogen Stabilizers (drop down menu)",null,null,null,null,null,null,null,null,null,null,null,"Nitrogen Stabilizers (drop down menu)"]
["None",{"$f":"VLOOKUP(A86,NitrogenStabilizers,14,FALSE)","v":0},{"$f":"VLOOKUP(A86,NitrogenStabilizers,18,FALSE)","v":0},{"$f":"VLOOKUP(A86,NitrogenStabilizers,16,FALSE)","v":1},0,{"$f":"VLOOKUP(A86,NitrogenStabilizers,15,FALSE)","v":0},{"$f":"(E86*VLOOKUP(A86,NitrogenStabilizers,14,FALSE)/D86)*C86","v":0},null,null,null,null,null,"None",{"$f":"VLOOKUP(M86,NitrogenStabilizers,14,FALSE)","v":0},{"$f":"VLOOKUP(M86,NitrogenStabilizers,18,FALSE)","v":0},{"$f":"VLOOKUP(M86,NitrogenStabilizers,16,FALSE)","v":1},0,{"$f":"VLOOKUP(M86,NitrogenStabilizers,15,FALSE)","v":0},{"$f":"(Q86*VLOOKUP(M86,NitrogenStabilizers,14,FALSE)/P86)*O86","v":0},null,null,null,null,null,"None",{"$f":"VLOOKUP(Y86,NitrogenStabilizers,14,FALSE)","v":0},{"$f":"VLOOKUP(Y86,NitrogenStabilizers,18,FALSE)","v":0},{"$f":"VLOOKUP(Y86,NitrogenStabilizers,16,FALSE)","v":1},0,{"$f":"VLOOKUP(Y86,NitrogenStabilizers,15,FALSE)","v":0},{"$f":"(AC86*VLOOKUP(Y86,NitrogenStabilizers,14,FALSE)/AB86)*AA86","v":0}]
["None",{"$f":"VLOOKUP(A87,NitrogenStabilizers,14,FALSE)","v":0},{"$f":"VLOOKUP(A87,NitrogenStabilizers,18,FALSE)","v":0},{"$f":"VLOOKUP(A87,NitrogenStabilizers,16,FALSE)","v":1},0,{"$f":"VLOOKUP(A87,NitrogenStabilizers,15,FALSE)","v":0},{"$f":"(E87*VLOOKUP(A87,NitrogenStabilizers,14,FALSE)/D87)*C87","v":0},null,null,null,"More",null,"None",{"$f":"VLOOKUP(M87,NitrogenStabilizers,14,FALSE)","v":0},{"$f":"VLOOKUP(M87,NitrogenStabilizers,18,FALSE)","v":0},{"$f":"VLOOKUP(M87,NitrogenStabilizers,16,FALSE)","v":1},0,{"$f":"VLOOKUP(M87,NitrogenStabilizers,15,FALSE)","v":0},{"$f":"(Q87*VLOOKUP(M87,NitrogenStabilizers,14,FALSE)/P87)*O87","v":0},null,null,null,"More",null,"None",{"$f":"VLOOKUP(Y87,NitrogenStabilizers,14,FALSE)","v":0},{"$f":"VLOOKUP(Y87,NitrogenStabilizers,18,FALSE)","v":0},{"$f":"VLOOKUP(Y87,NitrogenStabilizers,16,FALSE)","v":1},0,{"$f":"VLOOKUP(Y87,NitrogenStabilizers,15,FALSE)","v":0},{"$f":"(AC87*VLOOKUP(Y87,NitrogenStabilizers,14,FALSE)/AB87)*AA87","v":0},null,null,null,"More"]
["4th Application Fertilizer Cost/Acre",null,null,null,null,null,{"$f":"SUM(G72:G87)","v":0},null,null,null,"Below",null,"4th Application Fertilizer Cost/Acre",null,null,null,null,null,{"$f":"SUM(S72:S87)","v":0},null,null,null,"Below",null,"4th Application Fertilizer Cost/Acre",null,null,null,null,null,{"$f":"SUM(AE72:AE87)","v":0},null,null,null,"Below"]
[null,null,null,null,null,null,null,null,null,null,"¯",null,null,null,null,null,null,null,null,null,null,null,"¯",null,null,null,null,null,null,null,null,null,null,null,"¯"]
["5th Application (i.e., Side-Dress or Broadcast or Fertigation)",null,null,null,null,null,null,null,null,null,null,null,"5th Application (i.e., Side-Dress or Broadcast or Fertigation)",null,null,null,null,null,null,null,null,null,null,null,"5th Application (i.e., Side-Dress or Broadcast or Fertigation)"]
["Fertilizer Source","Purchase Units","Package Price (Gals, Lbs, etc.)","Units/Pkg","Rate/Acre","Units","Cost",null,null,null,null,null,"Fertilizer Source","Purchase Units","Package Price (Gals, Lbs, etc.)","Units/Pkg","Rate/Acre","Units","Cost",null,null,null,null,null,"Fertilizer Source","Purchase Units","Package Price (Gals, Lbs, etc.)","Units/Pkg","Rate/Acre","Units","Cost"]
["Macronutrients (drop down menu)",null,null,null,"(Enter Below)",null,null,null,"N","P","K",null,"Macronutrients (drop down menu)",null,null,null,"(Enter Below)",null,null,null,"N","P","K",null,"Macronutrients (drop down menu)",null,null,null,"(Enter Below)",null,null,null,"N","P","K"]
["None",{"$f":"VLOOKUP(A93,Macronutrients,14,FALSE)","v":0},{"$f":"VLOOKUP(A93,Macronutrients,18,FALSE)","v":0},{"$f":"VLOOKUP(A93,Macronutrients,16,FALSE)","v":1},0,{"$f":"VLOOKUP(A93,Macronutrients,15,FALSE)","v":0},{"$f":"(E93*VLOOKUP(A93,Macronutrients,14,FALSE)/D93)*C93","v":0},null,{"$f":"VLOOKUP(A93,Macronutrients,2,FALSE)*E93+VLOOKUP(A94,Macronutrients,2,FALSE)*E94+VLOOKUP(A95,Macronutrients,2,FALSE)*E95+VLOOKUP(A96,Macronutrients,2,FALSE)*E96+VLOOKUP(A97,Macronutrients,2,FALSE)*E97+VLOOKUP(A98,Macronutrients,2,FALSE)*E98+VLOOKUP(A101,Micronutrients,2,FALSE)*E101+VLOOKUP(A102,Micronutrients,2,FALSE)*E102+VLOOKUP(A103,Micronutrients,2,FALSE)*E103+VLOOKUP(A104,Micronutrients,2,FALSE)*E104","v":0},{"$f":"VLOOKUP(A93,Macronutrients,3,FALSE)*E93+VLOOKUP(A94,Macronutrients,3,FALSE)*E94+VLOOKUP(A95,Macronutrients,3,FALSE)*E95+VLOOKUP(A96,Macronutrients,3,FALSE)*E96+VLOOKUP(A97,Macronutrients,3,FALSE)*E97+VLOOKUP(A98,Macronutrients,3,FALSE)*E98+VLOOKUP(A101,Micronutrients,3,FALSE)*E101+VLOOKUP(A102,Micronutrients,3,FALSE)*E102+VLOOKUP(A103,Micronutrients,3,FALSE)*E103+VLOOKUP(A104,Micronutrients,3,FALSE)*E104","v":0},{"$f":"VLOOKUP(A93,Macronutrients,4,FALSE)*E93+VLOOKUP(A94,Macronutrients,4,FALSE)*E94+VLOOKUP(A95,Macronutrients,4,FALSE)*E95+VLOOKUP(A96,Macronutrients,4,FALSE)*E96+VLOOKUP(A97,Macronutrients,4,FALSE)*E97+VLOOKUP(A98,Macronutrients,4,FALSE)*E98+VLOOKUP(A101,Micronutrients,4,FALSE)*E101+VLOOKUP(A102,Micronutrients,4,FALSE)*E102+VLOOKUP(A103,Micronutrients,4,FALSE)*E103+VLOOKUP(A104,Micronutrients,4,FALSE)*E104","v":0},null,"None",{"$f":"VLOOKUP(M93,Macronutrients,14,FALSE)","v":0},{"$f":"VLOOKUP(M93,Macronutrients,18,FALSE)","v":0},{"$f":"VLOOKUP(M93,Macronutrients,16,FALSE)","v":1},0,{"$f":"VLOOKUP(M93,Macronutrients,15,FALSE)","v":0},{"$f":"(Q93*VLOOKUP(M93,Macronutrients,14,FALSE)/P93)*O93","v":0},null,{"$f":"VLOOKUP(M93,Macronutrients,2,FALSE)*Q93+VLOOKUP(M94,Macronutrients,2,FALSE)*Q94+VLOOKUP(M95,Macronutrients,2,FALSE)*Q95+VLOOKUP(M96,Macronutrients,2,FALSE)*Q96+VLOOKUP(M97,Macronutrients,2,FALSE)*Q97+VLOOKUP(M98,Macronutrients,2,FALSE)*Q98+VLOOKUP(M101,Micronutrients,2,FALSE)*Q101+VLOOKUP(M102,Micronutrients,2,FALSE)*Q102+VLOOKUP(M103,Micronutrients,2,FALSE)*Q103+VLOOKUP(M104,Micronutrients,2,FALSE)*Q104","v":0},{"$f":"VLOOKUP(M93,Macronutrients,3,FALSE)*Q93+VLOOKUP(M94,Macronutrients,3,FALSE)*Q94+VLOOKUP(M95,Macronutrients,3,FALSE)*Q95+VLOOKUP(M96,Macronutrients,3,FALSE)*Q96+VLOOKUP(M97,Macronutrients,3,FALSE)*Q97+VLOOKUP(M98,Macronutrients,3,FALSE)*Q98+VLOOKUP(M101,Micronutrients,3,FALSE)*Q101+VLOOKUP(M102,Micronutrients,3,FALSE)*Q102+VLOOKUP(M103,Micronutrients,3,FALSE)*Q103+VLOOKUP(M104,Micronutrients,3,FALSE)*Q104","v":0},{"$f":"VLOOKUP(M93,Macronutrients,4,FALSE)*Q93+VLOOKUP(M94,Macronutrients,4,FALSE)*Q94+VLOOKUP(M95,Macronutrients,4,FALSE)*Q95+VLOOKUP(M96,Macronutrients,4,FALSE)*Q96+VLOOKUP(M97,Macronutrients,4,FALSE)*Q97+VLOOKUP(M98,Macronutrients,4,FALSE)*Q98+VLOOKUP(M101,Micronutrients,4,FALSE)*Q101+VLOOKUP(M102,Micronutrients,4,FALSE)*Q102+VLOOKUP(M103,Micronutrients,4,FALSE)*Q103+VLOOKUP(M104,Micronutrients,4,FALSE)*Q104","v":0},null,"None",{"$f":"VLOOKUP(Y93,Macronutrients,14,FALSE)","v":0},{"$f":"VLOOKUP(Y93,Macronutrients,18,FALSE)","v":0},{"$f":"VLOOKUP(Y93,Macronutrients,16,FALSE)","v":1},0,{"$f":"VLOOKUP(Y93,Macronutrients,15,FALSE)","v":0},{"$f":"(AC93*VLOOKUP(Y93,Macronutrients,14,FALSE)/AB93)*AA93","v":0},null,{"$f":"VLOOKUP(Y93,Macronutrients,2,FALSE)*AC93+VLOOKUP(Y94,Macronutrients,2,FALSE)*AC94+VLOOKUP(Y95,Macronutrients,2,FALSE)*AC95+VLOOKUP(Y96,Macronutrients,2,FALSE)*AC96+VLOOKUP(Y97,Macronutrients,2,FALSE)*AC97+VLOOKUP(Y98,Macronutrients,2,FALSE)*AC98+VLOOKUP(Y101,Micronutrients,2,FALSE)*AC101+VLOOKUP(Y102,Micronutrients,2,FALSE)*AC102+VLOOKUP(Y103,Micronutrients,2,FALSE)*AC103+VLOOKUP(Y104,Micronutrients,2,FALSE)*AC104","v":0},{"$f":"VLOOKUP(Y93,Macronutrients,3,FALSE)*AC93+VLOOKUP(Y94,Macronutrients,3,FALSE)*AC94+VLOOKUP(Y95,Macronutrients,3,FALSE)*AC95+VLOOKUP(Y96,Macronutrients,3,FALSE)*AC96+VLOOKUP(Y97,Macronutrients,3,FALSE)*AC97+VLOOKUP(Y98,Macronutrients,3,FALSE)*AC98+VLOOKUP(Y101,Micronutrients,3,FALSE)*AC101+VLOOKUP(Y102,Micronutrients,3,FALSE)*AC102+VLOOKUP(Y103,Micronutrients,3,FALSE)*AC103+VLOOKUP(Y104,Micronutrients,3,FALSE)*AC104","v":0},{"$f":"VLOOKUP(Y93,Macronutrients,4,FALSE)*AC93+VLOOKUP(Y94,Macronutrients,4,FALSE)*AC94+VLOOKUP(Y95,Macronutrients,4,FALSE)*AC95+VLOOKUP(Y96,Macronutrients,4,FALSE)*AC96+VLOOKUP(Y97,Macronutrients,4,FALSE)*AC97+VLOOKUP(Y98,Macronutrients,4,FALSE)*AC98+VLOOKUP(Y101,Micronutrients,4,FALSE)*AC101+VLOOKUP(Y102,Micronutrients,4,FALSE)*AC102+VLOOKUP(Y103,Micronutrients,4,FALSE)*AC103+VLOOKUP(Y104,Micronutrients,4,FALSE)*AC104","v":0}]
["None",0,0,1,0,0,0,null,null,null,null,null,"None",0,0,1,0,0,0,null,null,null,null,null,"None",0,0,1,0,0,0]
["None",0,0,1,0,0,0,null,"S","Ca","Mg",null,"None",0,0,1,0,0,0,null,"S","Ca","Mg",null,"None",0,0,1,0,0,0,null,"S","Ca","Mg"]
["None",0,0,1,0,0,0,null,{"$f":"VLOOKUP(A93,Macronutrients,5,FALSE)*E93+VLOOKUP(A94,Macronutrients,5,FALSE)*E94+VLOOKUP(A95,Macronutrients,5,FALSE)*E95+VLOOKUP(A96,Macronutrients,5,FALSE)*E96+VLOOKUP(A97,Macronutrients,5,FALSE)*E97+VLOOKUP(A98,Macronutrients,5,FALSE)*E98+VLOOKUP(A101,Micronutrients,5,FALSE)*E101+VLOOKUP(A102,Micronutrients,5,FALSE)*E102+VLOOKUP(A103,Micronutrients,5,FALSE)*E103+VLOOKUP(A104,Micronutrients,5,FALSE)*E104","v":0},{"$f":"VLOOKUP(A93,Macronutrients,7,FALSE)*E93+VLOOKUP(A94,Macronutrients,7,FALSE)*E94+VLOOKUP(A95,Macronutrients,7,FALSE)*E95+VLOOKUP(A96,Macronutrients,7,FALSE)*E96+VLOOKUP(A97,Macronutrients,7,FALSE)*E97+VLOOKUP(A98,Macronutrients,7,FALSE)*E98+VLOOKUP(A101,Micronutrients,7,FALSE)*E101+VLOOKUP(A102,Micronutrients,7,FALSE)*E102+VLOOKUP(A103,Micronutrients,7,FALSE)*E103+VLOOKUP(A104,Micronutrients,7,FALSE)*E104","v":0},{"$f":"VLOOKUP($A93,Macronutrients,6,FALSE)*$E$6+VLOOKUP($A94,Macronutrients,6,FALSE)*$E$7+VLOOKUP($A95,Macronutrients,6,FALSE)*$E$8+VLOOKUP($A96,Macronutrients,6,FALSE)*$E$9+VLOOKUP($A97,Macronutrients,6,FALSE)*$E$10+VLOOKUP($A98,Macronutrients,6,FALSE)*$E$11+VLOOKUP($A101,Micronutrients,6,FALSE)*$E$14+VLOOKUP($A102,Micronutrients,6,FALSE)*E102+VLOOKUP($A103,Micronutrients,6,FALSE)*$E$16+VLOOKUP($A104,Micronutrients,6,FALSE)*$E$17","v":0},null,"None",0,0,1,0,0,0,null,{"$f":"VLOOKUP(M93,Macronutrients,5,FALSE)*Q93+VLOOKUP(M94,Macronutrients,5,FALSE)*Q94+VLOOKUP(M95,Macronutrients,5,FALSE)*Q95+VLOOKUP(M96,Macronutrients,5,FALSE)*Q96+VLOOKUP(M97,Macronutrients,5,FALSE)*Q97+VLOOKUP(M98,Macronutrients,5,FALSE)*Q98+VLOOKUP(M101,Micronutrients,5,FALSE)*Q101+VLOOKUP(M102,Micronutrients,5,FALSE)*Q102+VLOOKUP(M103,Micronutrients,5,FALSE)*Q103+VLOOKUP(M104,Micronutrients,5,FALSE)*Q104","v":0},{"$f":"VLOOKUP(M93,Macronutrients,7,FALSE)*Q93+VLOOKUP(M94,Macronutrients,7,FALSE)*Q94+VLOOKUP(M95,Macronutrients,7,FALSE)*Q95+VLOOKUP(M96,Macronutrients,7,FALSE)*Q96+VLOOKUP(M97,Macronutrients,7,FALSE)*Q97+VLOOKUP(M98,Macronutrients,7,FALSE)*Q98+VLOOKUP(M101,Micronutrients,7,FALSE)*Q101+VLOOKUP(M102,Micronutrients,7,FALSE)*Q102+VLOOKUP(M103,Micronutrients,7,FALSE)*Q103+VLOOKUP(M104,Micronutrients,7,FALSE)*Q104","v":0},{"$f":"VLOOKUP($A93,Macronutrients,6,FALSE)*$E$6+VLOOKUP($A94,Macronutrients,6,FALSE)*$E$7+VLOOKUP($A95,Macronutrients,6,FALSE)*$E$8+VLOOKUP($A96,Macronutrients,6,FALSE)*$E$9+VLOOKUP($A97,Macronutrients,6,FALSE)*$E$10+VLOOKUP($A98,Macronutrients,6,FALSE)*$E$11+VLOOKUP($A101,Micronutrients,6,FALSE)*$E$14+VLOOKUP($A102,Micronutrients,6,FALSE)*Q102+VLOOKUP($A103,Micronutrients,6,FALSE)*$E$16+VLOOKUP($A104,Micronutrients,6,FALSE)*$E$17","v":0},null,"None",0,0,1,0,0,0,null,{"$f":"VLOOKUP(Y93,Macronutrients,5,FALSE)*AC93+VLOOKUP(Y94,Macronutrients,5,FALSE)*AC94+VLOOKUP(Y95,Macronutrients,5,FALSE)*AC95+VLOOKUP(Y96,Macronutrients,5,FALSE)*AC96+VLOOKUP(Y97,Macronutrients,5,FALSE)*AC97+VLOOKUP(Y98,Macronutrients,5,FALSE)*AC98+VLOOKUP(Y101,Micronutrients,5,FALSE)*AC101+VLOOKUP(Y102,Micronutrients,5,FALSE)*AC102+VLOOKUP(Y103,Micronutrients,5,FALSE)*AC103+VLOOKUP(Y104,Micronutrients,5,FALSE)*AC104","v":0},{"$f":"VLOOKUP(Y93,Macronutrients,7,FALSE)*AC93+VLOOKUP(Y94,Macronutrients,7,FALSE)*AC94+VLOOKUP(Y95,Macronutrients,7,FALSE)*AC95+VLOOKUP(Y96,Macronutrients,7,FALSE)*AC96+VLOOKUP(Y97,Macronutrients,7,FALSE)*AC97+VLOOKUP(Y98,Macronutrients,7,FALSE)*AC98+VLOOKUP(Y101,Micronutrients,7,FALSE)*AC101+VLOOKUP(Y102,Micronutrients,7,FALSE)*AC102+VLOOKUP(Y103,Micronutrients,7,FALSE)*AC103+VLOOKUP(Y104,Micronutrients,7,FALSE)*AC104","v":0},{"$f":"VLOOKUP($A93,Macronutrients,6,FALSE)*$E$6+VLOOKUP($A94,Macronutrients,6,FALSE)*$E$7+VLOOKUP($A95,Macronutrients,6,FALSE)*$E$8+VLOOKUP($A96,Macronutrients,6,FALSE)*$E$9+VLOOKUP($A97,Macronutrients,6,FALSE)*$E$10+VLOOKUP($A98,Macronutrients,6,FALSE)*$E$11+VLOOKUP($A101,Micronutrients,6,FALSE)*$E$14+VLOOKUP($A102,Micronutrients,6,FALSE)*AC102+VLOOKUP($A103,Micronutrients,6,FALSE)*$E$16+VLOOKUP($A104,Micronutrients,6,FALSE)*$E$17","v":0}]
["None",0,0,1,0,0,0,null,null,null,null,null,"None",0,0,1,0,0,0,null,null,null,null,null,"None",0,0,1,0,0,0]
["None",0,0,1,0,0,0,null,"Z","B","Mn",null,"None",0,0,1,0,0,0,null,"Z","B","Mn",null,"None",0,0,1,0,0,0,null,"Z","B","Mn"]
[null,null,null,null,null,null,null,null,{"$f":"VLOOKUP(A93,Macronutrients,8,FALSE)*E93+VLOOKUP(A94,Macronutrients,8,FALSE)*E94+VLOOKUP(A95,Macronutrients,8,FALSE)*E95+VLOOKUP(A96,Macronutrients,8,FALSE)*E96+VLOOKUP(A97,Macronutrients,8,FALSE)*E97+VLOOKUP(A98,Macronutrients,8,FALSE)*E98+VLOOKUP(A101,Micronutrients,8,FALSE)*E101+VLOOKUP(A102,Micronutrients,8,FALSE)*E102+VLOOKUP(A103,Micronutrients,8,FALSE)*E103+VLOOKUP(A104,Micronutrients,8,FALSE)*E104","v":0},{"$f":"VLOOKUP(A93,Macronutrients,9,FALSE)*E93+VLOOKUP(A94,Macronutrients,9,FALSE)*E94+VLOOKUP(A95,Macronutrients,9,FALSE)*E95+VLOOKUP(A96,Macronutrients,9,FALSE)*E96+VLOOKUP(A97,Macronutrients,9,FALSE)*E97+VLOOKUP(A98,Macronutrients,9,FALSE)*E98+VLOOKUP(A101,Micronutrients,9,FALSE)*E101+VLOOKUP(A102,Micronutrients,9,FALSE)*E102+VLOOKUP(A103,Micronutrients,9,FALSE)*E103+VLOOKUP(A104,Micronutrients,9,FALSE)*E104","v":0},{"$f":"VLOOKUP(A93,Macronutrients,10,FALSE)*E93+VLOOKUP(A94,Macronutrients,10,FALSE)*E94+VLOOKUP(A95,Macronutrients,10,FALSE)*E95+VLOOKUP(A96,Macronutrients,10,FALSE)*E96+VLOOKUP(A97,Macronutrients,10,FALSE)*E97+VLOOKUP(A98,Macronutrients,10,FALSE)*E98+VLOOKUP(A101,Micronutrients,10,FALSE)*E101+VLOOKUP(A102,Micronutrients,10,FALSE)*E102+VLOOKUP(A103,Micronutrients,10,FALSE)*E103+VLOOKUP(A104,Micronutrients,10,FALSE)*E104","v":0},null,null,null,null,null,null,null,null,null,{"$f":"VLOOKUP(M93,Macronutrients,8,FALSE)*Q93+VLOOKUP(M94,Macronutrients,8,FALSE)*Q94+VLOOKUP(M95,Macronutrients,8,FALSE)*Q95+VLOOKUP(M96,Macronutrients,8,FALSE)*Q96+VLOOKUP(M97,Macronutrients,8,FALSE)*Q97+VLOOKUP(M98,Macronutrients,8,FALSE)*Q98+VLOOKUP(M101,Micronutrients,8,FALSE)*Q101+VLOOKUP(M102,Micronutrients,8,FALSE)*Q102+VLOOKUP(M103,Micronutrients,8,FALSE)*Q103+VLOOKUP(M104,Micronutrients,8,FALSE)*Q104","v":0},{"$f":"VLOOKUP(M93,Macronutrients,9,FALSE)*Q93+VLOOKUP(M94,Macronutrients,9,FALSE)*Q94+VLOOKUP(M95,Macronutrients,9,FALSE)*Q95+VLOOKUP(M96,Macronutrients,9,FALSE)*Q96+VLOOKUP(M97,Macronutrients,9,FALSE)*Q97+VLOOKUP(M98,Macronutrients,9,FALSE)*Q98+VLOOKUP(M101,Micronutrients,9,FALSE)*Q101+VLOOKUP(M102,Micronutrients,9,FALSE)*Q102+VLOOKUP(M103,Micronutrients,9,FALSE)*Q103+VLOOKUP(M104,Micronutrients,9,FALSE)*Q104","v":0},{"$f":"VLOOKUP(M93,Macronutrients,10,FALSE)*Q93+VLOOKUP(M94,Macronutrients,10,FALSE)*Q94+VLOOKUP(M95,Macronutrients,10,FALSE)*Q95+VLOOKUP(M96,Macronutrients,10,FALSE)*Q96+VLOOKUP(M97,Macronutrients,10,FALSE)*Q97+VLOOKUP(M98,Macronutrients,10,FALSE)*Q98+VLOOKUP(M101,Micronutrients,10,FALSE)*Q101+VLOOKUP(M102,Micronutrients,10,FALSE)*Q102+VLOOKUP(M103,Micronutrients,10,FALSE)*Q103+VLOOKUP(M104,Micronutrients,10,FALSE)*Q104","v":0},null,null,null,null,null,null,null,null,null,{"$f":"VLOOKUP(Y93,Macronutrients,8,FALSE)*AC93+VLOOKUP(Y94,Macronutrients,8,FALSE)*AC94+VLOOKUP(Y95,Macronutrients,8,FALSE)*AC95+VLOOKUP(Y96,Macronutrients,8,FALSE)*AC96+VLOOKUP(Y97,Macronutrients,8,FALSE)*AC97+VLOOKUP(Y98,Macronutrients,8,FALSE)*AC98+VLOOKUP(Y101,Micronutrients,8,FALSE)*AC101+VLOOKUP(Y102,Micronutrients,8,FALSE)*AC102+VLOOKUP(Y103,Micronutrients,8,FALSE)*AC103+VLOOKUP(Y104,Micronutrients,8,FALSE)*AC104","v":0},{"$f":"VLOOKUP(Y93,Macronutrients,9,FALSE)*AC93+VLOOKUP(Y94,Macronutrients,9,FALSE)*AC94+VLOOKUP(Y95,Macronutrients,9,FALSE)*AC95+VLOOKUP(Y96,Macronutrients,9,FALSE)*AC96+VLOOKUP(Y97,Macronutrients,9,FALSE)*AC97+VLOOKUP(Y98,Macronutrients,9,FALSE)*AC98+VLOOKUP(Y101,Micronutrients,9,FALSE)*AC101+VLOOKUP(Y102,Micronutrients,9,FALSE)*AC102+VLOOKUP(Y103,Micronutrients,9,FALSE)*AC103+VLOOKUP(Y104,Micronutrients,9,FALSE)*AC104","v":0},{"$f":"VLOOKUP(Y93,Macronutrients,10,FALSE)*AC93+VLOOKUP(Y94,Macronutrients,10,FALSE)*AC94+VLOOKUP(Y95,Macronutrients,10,FALSE)*AC95+VLOOKUP(Y96,Macronutrients,10,FALSE)*AC96+VLOOKUP(Y97,Macronutrients,10,FALSE)*AC97+VLOOKUP(Y98,Macronutrients,10,FALSE)*AC98+VLOOKUP(Y101,Micronutrients,10,FALSE)*AC101+VLOOKUP(Y102,Micronutrients,10,FALSE)*AC102+VLOOKUP(Y103,Micronutrients,10,FALSE)*AC103+VLOOKUP(Y104,Micronutrients,10,FALSE)*AC104","v":0}]
["Micronutrients (drop down menu)",null,null,null,null,null,null,null,null,null,null,null,"Micronutrients (drop down menu)",null,null,null,null,null,null,null,null,null,null,null,"Micronutrients (drop down menu)"]
["None",{"$f":"VLOOKUP($A101,Micronutrients,14,FALSE)","v":0},{"$f":"VLOOKUP(A101,Micronutrients,18,FALSE)","v":0},{"$f":"VLOOKUP(A101,Micronutrients,16,FALSE)","v":1},0,{"$f":"VLOOKUP(A101,Micronutrients,15,FALSE)","v":0},{"$f":"(E101*VLOOKUP(A101,Micronutrients,14,FALSE)/D101)*C101","v":0},null,"Cu","Mo","Fe",null,"None",{"$f":"VLOOKUP($M101,Micronutrients,14,FALSE)","v":0},{"$f":"VLOOKUP(M101,Micronutrients,18,FALSE)","v":0},{"$f":"VLOOKUP(M101,Micronutrients,16,FALSE)","v":1},0,{"$f":"VLOOKUP(M101,Micronutrients,15,FALSE)","v":0},{"$f":"(Q101*VLOOKUP(M101,Micronutrients,14,FALSE)/P101)*O101","v":0},null,"Cu","Mo","Fe",null,"None",{"$f":"VLOOKUP(Y101,Micronutrients,14,FALSE)","v":0},{"$f":"VLOOKUP(Y101,Micronutrients,18,FALSE)","v":0},{"$f":"VLOOKUP(Y101,Micronutrients,16,FALSE)","v":1},0,{"$f":"VLOOKUP(Y101,Micronutrients,15,FALSE)","v":0},{"$f":"(AC101*VLOOKUP(Y101,Micronutrients,14,FALSE)/AB101)*AA101","v":0},null,"Cu","Mo","Fe"]
["None",{"$f":"VLOOKUP($A102,Micronutrients,14,FALSE)","v":0},{"$f":"VLOOKUP(A102,Micronutrients,18,FALSE)","v":0},{"$f":"VLOOKUP(A102,Micronutrients,16,FALSE)","v":1},0,{"$f":"VLOOKUP(A102,Micronutrients,15,FALSE)","v":0},{"$f":"(E102*VLOOKUP(A102,Micronutrients,14,FALSE)/D102)*C102","v":0},null,{"$f":"VLOOKUP(A93,Macronutrients,11,FALSE)*E93+VLOOKUP(A94,Macronutrients,11,FALSE)*E94+VLOOKUP(A95,Macronutrients,11,FALSE)*E95+VLOOKUP(A96,Macronutrients,11,FALSE)*E96+VLOOKUP(A97,Macronutrients,11,FALSE)*E97+VLOOKUP(A98,Macronutrients,11,FALSE)*E98+VLOOKUP(A101,Micronutrients,11,FALSE)*E101+VLOOKUP(A102,Micronutrients,11,FALSE)*E102+VLOOKUP(A103,Micronutrients,11,FALSE)*E103+VLOOKUP(A104,Micronutrients,11,FALSE)*E104","v":0},{"$f":"VLOOKUP(A93,Macronutrients,12,FALSE)*E93+VLOOKUP(A94,Macronutrients,12,FALSE)*E94+VLOOKUP(A95,Macronutrients,12,FALSE)*E95+VLOOKUP(A96,Macronutrients,12,FALSE)*E96+VLOOKUP(A97,Macronutrients,12,FALSE)*E97+VLOOKUP(A98,Macronutrients,12,FALSE)*E98+VLOOKUP(A101,Micronutrients,12,FALSE)*E101+VLOOKUP(A102,Micronutrients,12,FALSE)*E102+VLOOKUP(A103,Micronutrients,12,FALSE)*E103+VLOOKUP(A104,Micronutrients,12,FALSE)*E104","v":0},{"$f":"VLOOKUP(A93,Macronutrients,13,FALSE)*E93+VLOOKUP(A94,Macronutrients,13,FALSE)*E94+VLOOKUP(A95,Macronutrients,13,FALSE)*E95+VLOOKUP(A96,Macronutrients,13,FALSE)*E96+VLOOKUP(A97,Macronutrients,13,FALSE)*E97+VLOOKUP(A98,Macronutrients,13,FALSE)*E98+VLOOKUP(A101,Micronutrients,13,FALSE)*E101+VLOOKUP(A102,Micronutrients,13,FALSE)*E102+VLOOKUP(A103,Micronutrients,13,FALSE)*E103+VLOOKUP(A104,Micronutrients,13,FALSE)*E104","v":0},null,"None",{"$f":"VLOOKUP($M102,Micronutrients,14,FALSE)","v":0},{"$f":"VLOOKUP(M102,Micronutrients,18,FALSE)","v":0},{"$f":"VLOOKUP(M102,Micronutrients,16,FALSE)","v":1},0,{"$f":"VLOOKUP(M102,Micronutrients,15,FALSE)","v":0},{"$f":"(Q102*VLOOKUP(M102,Micronutrients,14,FALSE)/P102)*O102","v":0},null,{"$f":"VLOOKUP(M93,Macronutrients,11,FALSE)*Q93+VLOOKUP(M94,Macronutrients,11,FALSE)*Q94+VLOOKUP(M95,Macronutrients,11,FALSE)*Q95+VLOOKUP(M96,Macronutrients,11,FALSE)*Q96+VLOOKUP(M97,Macronutrients,11,FALSE)*Q97+VLOOKUP(M98,Macronutrients,11,FALSE)*Q98+VLOOKUP(M101,Micronutrients,11,FALSE)*Q101+VLOOKUP(M102,Micronutrients,11,FALSE)*Q102+VLOOKUP(M103,Micronutrients,11,FALSE)*Q103+VLOOKUP(M104,Micronutrients,11,FALSE)*Q104","v":0},{"$f":"VLOOKUP(M93,Macronutrients,12,FALSE)*Q93+VLOOKUP(M94,Macronutrients,12,FALSE)*Q94+VLOOKUP(M95,Macronutrients,12,FALSE)*Q95+VLOOKUP(M96,Macronutrients,12,FALSE)*Q96+VLOOKUP(M97,Macronutrients,12,FALSE)*Q97+VLOOKUP(M98,Macronutrients,12,FALSE)*Q98+VLOOKUP(M101,Micronutrients,12,FALSE)*Q101+VLOOKUP(M102,Micronutrients,12,FALSE)*Q102+VLOOKUP(M103,Micronutrients,12,FALSE)*Q103+VLOOKUP(M104,Micronutrients,12,FALSE)*Q104","v":0},{"$f":"VLOOKUP(M93,Macronutrients,13,FALSE)*Q93+VLOOKUP(M94,Macronutrients,13,FALSE)*Q94+VLOOKUP(M95,Macronutrients,13,FALSE)*Q95+VLOOKUP(M96,Macronutrients,13,FALSE)*Q96+VLOOKUP(M97,Macronutrients,13,FALSE)*Q97+VLOOKUP(M98,Macronutrients,13,FALSE)*Q98+VLOOKUP(M101,Micronutrients,13,FALSE)*Q101+VLOOKUP(M102,Micronutrients,13,FALSE)*Q102+VLOOKUP(M103,Micronutrients,13,FALSE)*Q103+VLOOKUP(M104,Micronutrients,13,FALSE)*Q104","v":0},null,"None",{"$f":"VLOOKUP(Y102,Micronutrients,14,FALSE)","v":0},{"$f":"VLOOKUP(Y102,Micronutrients,18,FALSE)","v":0},{"$f":"VLOOKUP(Y102,Micronutrients,16,FALSE)","v":1},0,{"$f":"VLOOKUP(Y102,Micronutrients,15,FALSE)","v":0},{"$f":"(AC102*VLOOKUP(Y102,Micronutrients,14,FALSE)/AB102)*AA102","v":0},null,{"$f":"VLOOKUP(Y93,Macronutrients,11,FALSE)*AC93+VLOOKUP(Y94,Macronutrients,11,FALSE)*AC94+VLOOKUP(Y95,Macronutrients,11,FALSE)*AC95+VLOOKUP(Y96,Macronutrients,11,FALSE)*AC96+VLOOKUP(Y97,Macronutrients,11,FALSE)*AC97+VLOOKUP(Y98,Macronutrients,11,FALSE)*AC98+VLOOKUP(Y101,Micronutrients,11,FALSE)*AC101+VLOOKUP(Y102,Micronutrients,11,FALSE)*AC102+VLOOKUP(Y103,Micronutrients,11,FALSE)*AC103+VLOOKUP(Y104,Micronutrients,11,FALSE)*AC104","v":0},{"$f":"VLOOKUP(Y93,Macronutrients,12,FALSE)*AC93+VLOOKUP(Y94,Macronutrients,12,FALSE)*AC94+VLOOKUP(Y95,Macronutrients,12,FALSE)*AC95+VLOOKUP(Y96,Macronutrients,12,FALSE)*AC96+VLOOKUP(Y97,Macronutrients,12,FALSE)*AC97+VLOOKUP(Y98,Macronutrients,12,FALSE)*AC98+VLOOKUP(Y101,Micronutrients,12,FALSE)*AC101+VLOOKUP(Y102,Micronutrients,12,FALSE)*AC102+VLOOKUP(Y103,Micronutrients,12,FALSE)*AC103+VLOOKUP(Y104,Micronutrients,12,FALSE)*AC104","v":0},{"$f":"VLOOKUP(Y93,Macronutrients,13,FALSE)*AC93+VLOOKUP(Y94,Macronutrients,13,FALSE)*AC94+VLOOKUP(Y95,Macronutrients,13,FALSE)*AC95+VLOOKUP(Y96,Macronutrients,13,FALSE)*AC96+VLOOKUP(Y97,Macronutrients,13,FALSE)*AC97+VLOOKUP(Y98,Macronutrients,13,FALSE)*AC98+VLOOKUP(Y101,Micronutrients,13,FALSE)*AC101+VLOOKUP(Y102,Micronutrients,13,FALSE)*AC102+VLOOKUP(Y103,Micronutrients,13,FALSE)*AC103+VLOOKUP(Y104,Micronutrients,13,FALSE)*AC104","v":0}]
["None",{"$f":"VLOOKUP($A103,Micronutrients,14,FALSE)","v":0},{"$f":"VLOOKUP(A103,Micronutrients,18,FALSE)","v":0},{"$f":"VLOOKUP(A103,Micronutrients,16,FALSE)","v":1},0,{"$f":"VLOOKUP(A103,Micronutrients,15,FALSE)","v":0},{"$f":"(E103*VLOOKUP(A103,Micronutrients,14,FALSE)/D103)*C103","v":0},null,null,null,null,null,"None",{"$f":"VLOOKUP($M103,Micronutrients,14,FALSE)","v":0},{"$f":"VLOOKUP(M103,Micronutrients,18,FALSE)","v":0},{"$f":"VLOOKUP(M103,Micronutrients,16,FALSE)","v":1},0,{"$f":"VLOOKUP(M103,Micronutrients,15,FALSE)","v":0},{"$f":"(Q103*VLOOKUP(M103,Micronutrients,14,FALSE)/P103)*O103","v":0},null,null,null,null,null,"None",{"$f":"VLOOKUP(Y103,Micronutrients,14,FALSE)","v":0},{"$f":"VLOOKUP(Y103,Micronutrients,18,FALSE)","v":0},{"$f":"VLOOKUP(Y103,Micronutrients,16,FALSE)","v":1},0,{"$f":"VLOOKUP(Y103,Micronutrients,15,FALSE)","v":0},{"$f":"(AC103*VLOOKUP(Y103,Micronutrients,14,FALSE)/AB103)*AA103","v":0}]
["None",{"$f":"VLOOKUP($A104,Micronutrients,14,FALSE)","v":0},{"$f":"VLOOKUP(A104,Micronutrients,18,FALSE)","v":0},{"$f":"VLOOKUP(A104,Micronutrients,16,FALSE)","v":1},0,{"$f":"VLOOKUP(A104,Micronutrients,15,FALSE)","v":0},{"$f":"(E104*VLOOKUP(A104,Micronutrients,14,FALSE)/D104)*C104","v":0},null,null,null,null,null,"None",{"$f":"VLOOKUP($M104,Micronutrients,14,FALSE)","v":0},{"$f":"VLOOKUP(M104,Micronutrients,18,FALSE)","v":0},{"$f":"VLOOKUP(M104,Micronutrients,16,FALSE)","v":1},0,{"$f":"VLOOKUP(M104,Micronutrients,15,FALSE)","v":0},{"$f":"(Q104*VLOOKUP(M104,Micronutrients,14,FALSE)/P104)*O104","v":0},null,null,null,null,null,"None",{"$f":"VLOOKUP(Y104,Micronutrients,14,FALSE)","v":0},{"$f":"VLOOKUP(Y104,Micronutrients,18,FALSE)","v":0},{"$f":"VLOOKUP(Y104,Micronutrients,16,FALSE)","v":1},0,{"$f":"VLOOKUP(Y104,Micronutrients,15,FALSE)","v":0},{"$f":"(AC104*VLOOKUP(Y104,Micronutrients,14,FALSE)/AB104)*AA104","v":0}]
[]
["Nitrogen Stabilizers (drop down menu)",null,null,null,null,null,null,null,null,null,null,null,"Nitrogen Stabilizers (drop down menu)",null,null,null,null,null,null,null,null,null,null,null,"Nitrogen Stabilizers (drop down menu)"]
["None",{"$f":"VLOOKUP(A107,NitrogenStabilizers,14,FALSE)","v":0},{"$f":"VLOOKUP(A107,NitrogenStabilizers,18,FALSE)","v":0},{"$f":"VLOOKUP(A107,NitrogenStabilizers,16,FALSE)","v":1},0,{"$f":"VLOOKUP(A107,NitrogenStabilizers,15,FALSE)","v":0},{"$f":"(E107*VLOOKUP(A107,NitrogenStabilizers,14,FALSE)/D107)*C107","v":0},null,null,null,null,null,"None",{"$f":"VLOOKUP(M107,NitrogenStabilizers,14,FALSE)","v":0},{"$f":"VLOOKUP(M107,NitrogenStabilizers,18,FALSE)","v":0},{"$f":"VLOOKUP(M107,NitrogenStabilizers,16,FALSE)","v":1},0,{"$f":"VLOOKUP(M107,NitrogenStabilizers,15,FALSE)","v":0},{"$f":"(Q107*VLOOKUP(M107,NitrogenStabilizers,14,FALSE)/P107)*O107","v":0},null,null,null,null,null,"None",{"$f":"VLOOKUP(Y107,NitrogenStabilizers,14,FALSE)","v":0},{"$f":"VLOOKUP(Y107,NitrogenStabilizers,18,FALSE)","v":0},{"$f":"VLOOKUP(Y107,NitrogenStabilizers,16,FALSE)","v":1},0,{"$f":"VLOOKUP(Y107,NitrogenStabilizers,15,FALSE)","v":0},{"$f":"(AC107*VLOOKUP(Y107,NitrogenStabilizers,14,FALSE)/AB107)*AA107","v":0}]
["None",{"$f":"VLOOKUP(A108,NitrogenStabilizers,14,FALSE)","v":0},{"$f":"VLOOKUP(A108,NitrogenStabilizers,18,FALSE)","v":0},{"$f":"VLOOKUP(A108,NitrogenStabilizers,16,FALSE)","v":1},0,{"$f":"VLOOKUP(A108,NitrogenStabilizers,15,FALSE)","v":0},{"$f":"(E108*VLOOKUP(A108,NitrogenStabilizers,14,FALSE)/D108)*C108","v":0},null,null,null,null,null,"None",{"$f":"VLOOKUP(M108,NitrogenStabilizers,14,FALSE)","v":0},{"$f":"VLOOKUP(M108,NitrogenStabilizers,18,FALSE)","v":0},{"$f":"VLOOKUP(M108,NitrogenStabilizers,16,FALSE)","v":1},0,{"$f":"VLOOKUP(M108,NitrogenStabilizers,15,FALSE)","v":0},{"$f":"(Q108*VLOOKUP(M108,NitrogenStabilizers,14,FALSE)/P108)*O108","v":0},null,null,null,null,null,"None",{"$f":"VLOOKUP(Y108,NitrogenStabilizers,14,FALSE)","v":0},{"$f":"VLOOKUP(Y108,NitrogenStabilizers,18,FALSE)","v":0},{"$f":"VLOOKUP(Y108,NitrogenStabilizers,16,FALSE)","v":1},0,{"$f":"VLOOKUP(Y108,NitrogenStabilizers,15,FALSE)","v":0},{"$f":"(AC108*VLOOKUP(Y108,NitrogenStabilizers,14,FALSE)/AB108)*AA108","v":0}]
["5th Application Fertilizer Cost/Acre",null,null,null,null,null,{"$f":"SUM(G93:G108)","v":0},null,null,null,null,null,"5th Application Fertilizer Cost/Acre",null,null,null,null,null,{"$f":"SUM(S93:S108)","v":0},null,null,null,null,null,"5th Application Fertilizer Cost/Acre",null,null,null,null,null,{"$f":"SUM(AE93:AE108)","v":0}]
[]
["Total Fertilizer Cost/Acre",null,null,null,null,null,{"$f":"G109+G88+G25+G67+G46","v":0},null,null,null,null,null,"Total Fertilizer Cost/Acre",null,null,null,null,null,{"$f":"S109+S88+S25+S67+S46","v":0},null,null,null,null,null,"Total Fertilizer Cost/Acre",null,null,null,null,null,{"$f":"AE109+AE88+AE25+AE67+AE46","v":0}]
[]
[null,null,null,null,"Total Nutrient Needs",null,null,null,null,null,null,null,null,null,null,null,"Total Nutrient Needs",null,null,null,null,null,null,null,null,null,null,null,"Total Nutrient Needs"]
[null,null,null,null,"Based on:","Soil Test Based Recs",null,null,"Total Fertilizer Program",null,null,null,null,null,null,null,"Based on:","Soil Test Based Recs",null,null,"Total Fertilizer Program",null,null,null,null,null,null,null,"Based on:","Nutrient Removal",null,null,"Total Fertilizer Program"]
["Farm Name",null,null,null,"N","P","K",null,"N","P","K",null,{"$f":"A115","v":"Farm Name"},null,null,null,"N","P","K",null,"N","P","K",null,{"$f":"A115","v":"Farm Name"},null,null,null,"N","P","K",null,"N","P","K"]
["Farm Tract",null,null,null,{"$f":"'Nutrient Management'!F57","v":0},{"$f":"'Nutrient Management'!G57","v":0},{"$f":"'Nutrient Management'!H57","v":0},null,{"$f":"I6+I30+I51+I72+I93","v":0},{"$f":"J6+J30+J51+J72+J93","v":0},0,null,{"$f":"A116","v":"Farm Tract"},null,null,null,{"$f":"'Nutrient Management'!B57","v":0},{"$f":"'Nutrient Management'!C57","v":0},{"$f":"'Nutrient Management'!D57","v":0},null,{"$f":"U6+U30+U51+U72+U93","v":0},{"$f":"V6+V30+V51+V72+V93","v":0},0,null,{"$f":"A116","v":"Farm Tract"},null,null,null,{"$f":"'Nutrient Management'!B69","v":0},{"$f":"'Nutrient Management'!C57","v":0},{"$f":"'Nutrient Management'!D69","v":0},null,{"$f":"AG6+AG30+AG51+AG72+AG93","v":0},{"$f":"AH6+AH30+AH51+AH72+AH93","v":0},0]
["Farm Number",null,null,null,"S","Ca","Mg",null,"S","Ca","Mg",null,"Farm Number",null,null,null,"S","Ca","Mg",null,"S","Ca","Mg",null,"Farm Number",null,null,null,"S","Ca","Mg",null,"S","Ca","Mg"]
[null,null,null,null,{"$f":"'Nutrient Management'!F60","v":0},{"$f":"'Nutrient Management'!G60","v":0},{"$f":"'Nutrient Management'!H60","v":0},null,{"$f":"I9+I33+I54+I75+I96","v":0},{"$f":"J9+J33+J54+J75+J96","v":0},0,null,null,null,null,null,{"$f":"'Nutrient Management'!B60","v":0},{"$f":"'Nutrient Management'!C60","v":0},{"$f":"'Nutrient Management'!D60","v":0},null,{"$f":"U9+U33+U54+U75+U96","v":0},{"$f":"V9+V33+V54+V75+V96","v":0},0,null,null,null,null,null,{"$f":"'Nutrient Management'!B72","v":0},{"$f":"'Nutrient Management'!C72","v":0},{"$f":"'Nutrient Management'!D72","v":0},null,{"$f":"AG9+AG33+AG54+AG75+AG96","v":0},{"$f":"AH9+AH33+AH54+AH75+AH96","v":0},0]
[null,null,null,null,"Zn","B","Mn",null,"Zn","B","Mn",null,null,null,null,null,"Zn","B","Mn",null,"Zn","B","Mn",null,null,null,null,null,"Zn","B","Mn",null,"Zn","B","Mn"]
[null,null,null,null,{"$f":"'Nutrient Management'!F62","v":0},{"$f":"'Nutrient Management'!G62","v":0},{"$f":"'Nutrient Management'!H62","v":0},null,{"$f":"I12+I36+I57+I78+I99","v":0},{"$f":"J12+J36+J57+J78+J99","v":0},0,null,null,null,null,null,{"$f":"'Nutrient Management'!B62","v":0},{"$f":"'Nutrient Management'!C62","v":0},{"$f":"'Nutrient Management'!D62","v":0},null,{"$f":"U12+U36+U57+U78+U99","v":0},{"$f":"V12+V36+V57+V78+V99","v":0},0,null,null,null,null,null,{"$f":"'Nutrient Management'!B74","v":0},{"$f":"'Nutrient Management'!C74","v":0},{"$f":"'Nutrient Management'!D74","v":0},null,{"$f":"AG12+AG36+AG57+AG78+AG99","v":0},{"$f":"AH12+AH36+AH57+AH78+AH99","v":0},0]
[null,null,null,null,"Cu","Mo","Fe",null,"Cu","Mo","Fe",null,null,null,null,null,"Cu","Mo","Fe",null,"Cu","Mo","Fe",null,null,null,null,null,"Cu","Mo","Fe",null,"Cu","Mo","Fe"]
[null,null,null,null,{"$f":"'Nutrient Management'!F64","v":0},{"$f":"'Nutrient Management'!G64","v":0},{"$f":"'Nutrient Management'!H64","v":0},null,{"$f":"I15+I39+I60+I81+I102","v":0},{"$f":"J15+J39+J60+J81+J102","v":0},0,null,null,null,null,null,{"$f":"'Nutrient Management'!B64","v":0},{"$f":"'Nutrient Management'!C64","v":0},{"$f":"'Nutrient Management'!D64","v":0},null,{"$f":"U15+U39+U60+U81+U102","v":0},{"$f":"V15+V39+V60+V81+V102","v":0},0,null,null,null,null,null,{"$f":"'Nutrient Management'!B76","v":0},{"$f":"'Nutrient Management'!C76","v":0},{"$f":"'Nutrient Management'!D76","v":0},null,{"$f":"AG15+AG39+AG60+AG81+AG102","v":0},{"$f":"AH15+AH39+AH60+AH81+AH102","v":0},0]
[null,null,null,null,"* from Nutrient Management tab",null,null,null,null,null,null,null,null,null,null,null,"* from Nutrient Management tab",null,null,null,null,null,null,null,null,null,null,null,"* from Nutrient Management tab"]

{"sheet":"Fertilizer Plan (Grass)","index":9,"n_rows":123,"n_cols":35,"rows_kept":123,"cut":false,"hidden":false,"merged":[[113,5,113,6],[112,16,112,18],[113,17,113,18],[68,12,68,22],[89,0,89,10],[89,12,89,22],[113,20,113,22],[68,0,68,10],[89,24,89,34],[112,28,112,30],[112,4,112,6],[113,29,113,30],[16,8,21,10],[16,20,21,22],[16,32,21,34],[25,23,68,23],[26,0,26,10],[47,0,47,10],[26,12,26,22],[47,12,47,22],[26,24,26,34],[47,24,47,34],[113,32,113,34],[113,8,113,10],[68,24,68,34],[0,0,0,10],[0,12,0,22],[0,24,0,34],[2,0,2,10],[2,12,2,22],[2,24,2,34],[1,0,1,10],[1,12,1,22],[1,24,1,34]]}
["Grass",null,null,null,null,null,null,null,null,null,null,null,"Grass",null,null,null,null,null,null,null,null,null,null,null,"Grass"]
["Comparison Plan 1",null,null,null,null,null,null,null,null,null,null,null,"Comparison Plan 2",null,null,null,null,null,null,null,null,null,null,null,"Comparison Plan 3"]
["1st Application (i.e., Pre-Plant or Broadcast Fertilizer)",null,null,null,null,null,null,null,null,null,null,null,"1st Application (i.e., Pre-Plant or Broadcast Fertilizer)",null,null,null,null,null,null,null,null,null,null,null,"1st Application (i.e., Pre-Plant or Broadcast Fertilizer)"]
["Fertilizer Source","Purchase Units","Package Price (Gals, Lbs, etc.)","Units/Pkg","Rate/Acre","Units","Cost",null,null,null,null,null,"Fertilizer Source","Purchase Units","Package Price (Gals, Lbs, etc.)","Units/Pkg","Rate/Acre","Units","Cost",null,null,null,null,null,"Fertilizer Source","Purchase Units","Package Price (Gals, Lbs, etc.)","Units/Pkg","Rate/Acre","Units","Cost"]
["Macronutrients (drop down menu)",null,null,null,"(Enter Below)",null,null,null,"N","P","K",null,"Macronutrients (drop down menu)",null,null,null,"(Enter Below)",null,null,null,"N","P","K",null,"Macronutrients (drop down menu)",null,null,null,"(Enter Below)",null,null,null,"N","P","K"]
["None",{"$f":"VLOOKUP(A6,Macronutrients,14,FALSE)","v":0},{"$f":"VLOOKUP(A6,Macronutrients,18,FALSE)","v":0},{"$f":"VLOOKUP(A6,Macronutrients,16,FALSE)","v":1},0,{"$f":"VLOOKUP(A6,Macronutrients,15,FALSE)","v":0},{"$f":"(E6*VLOOKUP(A6,Macronutrients,14,FALSE)/D6)*C6","v":0},null,{"$f":"VLOOKUP(A6,Macronutrients,2,FALSE)*E6+VLOOKUP(A7,Macronutrients,2,FALSE)*E7+VLOOKUP(A8,Macronutrients,2,FALSE)*E8+VLOOKUP(A9,Macronutrients,2,FALSE)*E9+VLOOKUP(A10,Macronutrients,2,FALSE)*E10+VLOOKUP(A11,Macronutrients,2,FALSE)*E11+VLOOKUP(A14,Micronutrients,2,FALSE)*E14+VLOOKUP(A15,Micronutrients,2,FALSE)*E15+VLOOKUP(A16,Micronutrients,2,FALSE)*E16+VLOOKUP(A17,Micronutrients,2,FALSE)*E17","v":0},{"$f":"VLOOKUP(A6,Macronutrients,3,FALSE)*E6+VLOOKUP(A7,Macronutrients,3,FALSE)*E7+VLOOKUP(A8,Macronutrients,3,FALSE)*E8+VLOOKUP(A9,Macronutrients,3,FALSE)*E9+VLOOKUP(A10,Macronutrients,3,FALSE)*E10+VLOOKUP(A11,Macronutrients,3,FALSE)*E11+VLOOKUP(A14,Micronutrients,3,FALSE)*E14+VLOOKUP(A15,Micronutrients,3,FALSE)*E15+VLOOKUP(A16,Micronutrients,3,FALSE)*E16+VLOOKUP(A17,Micronutrients,3,FALSE)*E17","v":0},{"$f":"VLOOKUP(A6,Macronutrients,4,FALSE)*E6+VLOOKUP(A7,Macronutrients,4,FALSE)*E7+VLOOKUP(A8,Macronutrients,4,FALSE)*E8+VLOOKUP(A9,Macronutrients,4,FALSE)*E9+VLOOKUP(A10,Macronutrients,4,FALSE)*E10+VLOOKUP(A11,Macronutrients,4,FALSE)*E11+VLOOKUP(A14,Micronutrients,4,FALSE)*E14+VLOOKUP(A15,Micronutrients,4,FALSE)*E15+VLOOKUP(A16,Micronutrients,4,FALSE)*E16+VLOOKUP(A17,Micronutrients,4,FALSE)*E17","v":0},null,"None",{"$f":"VLOOKUP(M6,Macronutrients,14,FALSE)","v":0},{"$f":"VLOOKUP(M6,Macronutrients,18,FALSE)","v":0},{"$f":"VLOOKUP(M6,Macronutrients,16,FALSE)","v":1},0,{"$f":"VLOOKUP(M6,Macronutrients,15,FALSE)","v":0},{"$f":"(Q6*VLOOKUP(M6,Macronutrients,14,FALSE)/P6)*O6","v":0},null,{"$f":"VLOOKUP(M6,Macronutrients,2,FALSE)*Q6+VLOOKUP(M7,Macronutrients,2,FALSE)*Q7+VLOOKUP(M8,Macronutrients,2,FALSE)*Q8+VLOOKUP(M9,Macronutrients,2,FALSE)*Q9+VLOOKUP(M10,Macronutrients,2,FALSE)*Q10+VLOOKUP(M11,Macronutrients,2,FALSE)*Q11+VLOOKUP(M14,Micronutrients,2,FALSE)*Q14+VLOOKUP(M15,Micronutrients,2,FALSE)*Q15+VLOOKUP(M16,Micronutrients,2,FALSE)*Q16+VLOOKUP(M17,Micronutrients,2,FALSE)*Q17","v":0},{"$f":"VLOOKUP(M6,Macronutrients,3,FALSE)*Q6+VLOOKUP(M7,Macronutrients,3,FALSE)*Q7+VLOOKUP(M8,Macronutrients,3,FALSE)*Q8+VLOOKUP(M9,Macronutrients,3,FALSE)*Q9+VLOOKUP(M10,Macronutrients,3,FALSE)*Q10+VLOOKUP(M11,Macronutrients,3,FALSE)*Q11+VLOOKUP(M14,Micronutrients,3,FALSE)*Q14+VLOOKUP(M15,Micronutrients,3,FALSE)*Q15+VLOOKUP(M16,Micronutrients,3,FALSE)*Q16+VLOOKUP(M17,Micronutrients,3,FALSE)*Q17","v":0},{"$f":"VLOOKUP(M6,Macronutrients,4,FALSE)*Q6+VLOOKUP(M7,Macronutrients,4,FALSE)*Q7+VLOOKUP(M8,Macronutrients,4,FALSE)*Q8+VLOOKUP(M9,Macronutrients,4,FALSE)*Q9+VLOOKUP(M10,Macronutrients,4,FALSE)*Q10+VLOOKUP(M11,Macronutrients,4,FALSE)*Q11+VLOOKUP(M14,Micronutrients,4,FALSE)*Q14+VLOOKUP(M15,Micronutrients,4,FALSE)*Q15+VLOOKUP(M16,Micronutrients,4,FALSE)*Q16+VLOOKUP(M17,Micronutrients,4,FALSE)*Q17","v":0},null,"None",{"$f":"VLOOKUP(Y6,Macronutrients,14,FALSE)","v":0},{"$f":"VLOOKUP(Y6,Macronutrients,18,FALSE)","v":0},{"$f":"VLOOKUP(Y6,Macronutrients,16,FALSE)","v":1},0,{"$f":"VLOOKUP(Y6,Macronutrients,15,FALSE)","v":0},{"$f":"(AC6*VLOOKUP(Y6,Macronutrients,14,FALSE)/AB6)*AA6","v":0},null,{"$f":"VLOOKUP(Y6,Macronutrients,2,FALSE)*AC6+VLOOKUP(Y7,Macronutrients,2,FALSE)*AC7+VLOOKUP(Y8,Macronutrients,2,FALSE)*AC8+VLOOKUP(Y9,Macronutrients,2,FALSE)*AC9+VLOOKUP(Y10,Macronutrients,2,FALSE)*AC10+VLOOKUP(Y11,Macronutrients,2,FALSE)*AC11+VLOOKUP(Y14,Micronutrients,2,FALSE)*AC14+VLOOKUP(Y15,Micronutrients,2,FALSE)*AC15+VLOOKUP(Y16,Micronutrients,2,FALSE)*AC16+VLOOKUP(Y17,Micronutrients,2,FALSE)*AC17","v":0},{"$f":"VLOOKUP(Y6,Macronutrients,3,FALSE)*AC6+VLOOKUP(Y7,Macronutrients,3,FALSE)*AC7+VLOOKUP(Y8,Macronutrients,3,FALSE)*AC8+VLOOKUP(Y9,Macronutrients,3,FALSE)*AC9+VLOOKUP(Y10,Macronutrients,3,FALSE)*AC10+VLOOKUP(Y11,Macronutrients,3,FALSE)*AC11+VLOOKUP(Y14,Micronutrients,3,FALSE)*AC14+VLOOKUP(Y15,Micronutrients,3,FALSE)*AC15+VLOOKUP(Y16,Micronutrients,3,FALSE)*AC16+VLOOKUP(Y17,Micronutrients,3,FALSE)*AC17","v":0},{"$f":"VLOOKUP(Y6,Macronutrients,4,FALSE)*AC6+VLOOKUP(Y7,Macronutrients,4,FALSE)*AC7+VLOOKUP(Y8,Macronutrients,4,FALSE)*AC8+VLOOKUP(Y9,Macronutrients,4,FALSE)*AC9+VLOOKUP(Y10,Macronutrients,4,FALSE)*AC10+VLOOKUP(Y11,Macronutrients,4,FALSE)*AC11+VLOOKUP(Y14,Micronutrients,4,FALSE)*AC14+VLOOKUP(Y15,Micronutrients,4,FALSE)*AC15+VLOOKUP(Y16,Micronutrients,4,FALSE)*AC16+VLOOKUP(Y17,Micronutrients,4,FALSE)*AC17","v":0}]
["None",0,0,1,0,0,0,null,null,null,null,null,"None",0,0,1,0,0,0,null,null,null,null,null,"None",0,0,1,0,0,0]
["None",0,0,1,0,0,0,null,"S","Ca","Mg",null,"None",0,0,1,0,0,0,null,"S","Ca","Mg",null,"None",0,0,1,0,0,0,null,"S","Ca","Mg"]
["None",0,0,1,0,0,0,null,{"$f":"VLOOKUP(A6,Macronutrients,5,FALSE)*E6+VLOOKUP(A7,Macronutrients,5,FALSE)*E7+VLOOKUP(A8,Macronutrients,5,FALSE)*E8+VLOOKUP(A9,Macronutrients,5,FALSE)*E9+VLOOKUP(A10,Macronutrients,5,FALSE)*E10+VLOOKUP(A11,Macronutrients,5,FALSE)*E11+VLOOKUP(A14,Micronutrients,5,FALSE)*E14+VLOOKUP(A15,Micronutrients,5,FALSE)*E15+VLOOKUP(A16,Micronutrients,5,FALSE)*E16+VLOOKUP(A17,Micronutrients,5,FALSE)*E17+VLOOKUP(A20,Lime,5,FALSE)*E20","v":0},{"$f":"VLOOKUP(A6,Macronutrients,7,FALSE)*E6+VLOOKUP(A7,Macronutrients,7,FALSE)*E7+VLOOKUP(A8,Macronutrients,7,FALSE)*E8+VLOOKUP(A9,Macronutrients,7,FALSE)*E9+VLOOKUP(A10,Macronutrients,7,FALSE)*E10+VLOOKUP(A11,Macronutrients,7,FALSE)*E11+VLOOKUP(A14,Micronutrients,7,FALSE)*E14+VLOOKUP(A15,Micronutrients,7,FALSE)*E15+VLOOKUP(A16,Micronutrients,7,FALSE)*E16+VLOOKUP(A17,Micronutrients,7,FALSE)*E17+VLOOKUP(A20,Lime,7,FALSE)*E20","v":0},{"$f":"VLOOKUP($A6,Macronutrients,6,FALSE)*$E$6+VLOOKUP($A7,Macronutrients,6,FALSE)*$E$7+VLOOKUP($A8,Macronutrients,6,FALSE)*$E$8+VLOOKUP($A9,Macronutrients,6,FALSE)*$E$9+VLOOKUP($A10,Macronutrients,6,FALSE)*$E$10+VLOOKUP($A11,Macronutrients,6,FALSE)*$E$11+VLOOKUP($A14,Micronutrients,6,FALSE)*$E$14+VLOOKUP($A15,Micronutrients,6,FALSE)*E15+VLOOKUP($A16,Micronutrients,6,FALSE)*$E$16+VLOOKUP($A17,Micronutrients,6,FALSE)*$E$17+VLOOKUP($A20,Lime,6,FALSE)*E20","v":0},null,"None",0,0,1,0,0,0,null,{"$f":"VLOOKUP(M6,Macronutrients,5,FALSE)*Q6+VLOOKUP(M7,Macronutrients,5,FALSE)*Q7+VLOOKUP(M8,Macronutrients,5,FALSE)*Q8+VLOOKUP(M9,Macronutrients,5,FALSE)*Q9+VLOOKUP(M10,Macronutrients,5,FALSE)*Q10+VLOOKUP(M11,Macronutrients,5,FALSE)*Q11+VLOOKUP(M14,Micronutrients,5,FALSE)*Q14+VLOOKUP(M15,Micronutrients,5,FALSE)*Q15+VLOOKUP(M16,Micronutrients,5,FALSE)*Q16+VLOOKUP(M17,Micronutrients,5,FALSE)*Q17+VLOOKUP(M20,Lime,5,FALSE)*Q20","v":0},{"$f":"VLOOKUP(M6,Macronutrients,7,FALSE)*Q6+VLOOKUP(M7,Macronutrients,7,FALSE)*Q7+VLOOKUP(M8,Macronutrients,7,FALSE)*Q8+VLOOKUP(M9,Macronutrients,7,FALSE)*Q9+VLOOKUP(M10,Macronutrients,7,FALSE)*Q10+VLOOKUP(M11,Macronutrients,7,FALSE)*Q11+VLOOKUP(M14,Micronutrients,7,FALSE)*Q14+VLOOKUP(M15,Micronutrients,7,FALSE)*Q15+VLOOKUP(M16,Micronutrients,7,FALSE)*Q16+VLOOKUP(M17,Micronutrients,7,FALSE)*Q17+VLOOKUP(M20,Lime,7,FALSE)*Q20","v":0},{"$f":"VLOOKUP($A6,Macronutrients,6,FALSE)*$E$6+VLOOKUP($A7,Macronutrients,6,FALSE)*$E$7+VLOOKUP($A8,Macronutrients,6,FALSE)*$E$8+VLOOKUP($A9,Macronutrients,6,FALSE)*$E$9+VLOOKUP($A10,Macronutrients,6,FALSE)*$E$10+VLOOKUP($A11,Macronutrients,6,FALSE)*$E$11+VLOOKUP($A14,Micronutrients,6,FALSE)*$E$14+VLOOKUP($A15,Micronutrients,6,FALSE)*Q15+VLOOKUP($A16,Micronutrients,6,FALSE)*$E$16+VLOOKUP($A17,Micronutrients,6,FALSE)*$E$17+VLOOKUP($A20,Lime,6,FALSE)*Q20","v":0},null,"None",0,0,1,0,0,0,null,{"$f":"VLOOKUP(Y6,Macronutrients,5,FALSE)*AC6+VLOOKUP(Y7,Macronutrients,5,FALSE)*AC7+VLOOKUP(Y8,Macronutrients,5,FALSE)*AC8+VLOOKUP(Y9,Macronutrients,5,FALSE)*AC9+VLOOKUP(Y10,Macronutrients,5,FALSE)*AC10+VLOOKUP(Y11,Macronutrients,5,FALSE)*AC11+VLOOKUP(Y14,Micronutrients,5,FALSE)*AC14+VLOOKUP(Y15,Micronutrients,5,FALSE)*AC15+VLOOKUP(Y16,Micronutrients,5,FALSE)*AC16+VLOOKUP(Y17,Micronutrients,5,FALSE)*AC17+VLOOKUP(Y20,Lime,5,FALSE)*AC20","v":0},{"$f":"VLOOKUP(Y6,Macronutrients,7,FALSE)*AC6+VLOOKUP(Y7,Macronutrients,7,FALSE)*AC7+VLOOKUP(Y8,Macronutrients,7,FALSE)*AC8+VLOOKUP(Y9,Macronutrients,7,FALSE)*AC9+VLOOKUP(Y10,Macronutrients,7,FALSE)*AC10+VLOOKUP(Y11,Macronutrients,7,FALSE)*AC11+VLOOKUP(Y14,Micronutrients,7,FALSE)*AC14+VLOOKUP(Y15,Micronutrients,7,FALSE)*AC15+VLOOKUP(Y16,Micronutrients,7,FALSE)*AC16+VLOOKUP(Y17,Micronutrients,7,FALSE)*AC17+VLOOKUP(Y20,Lime,7,FALSE)*AC20","v":0},{"$f":"VLOOKUP($A6,Macronutrients,6,FALSE)*$E$6+VLOOKUP($A7,Macronutrients,6,FALSE)*$E$7+VLOOKUP($A8,Macronutrients,6,FALSE)*$E$8+VLOOKUP($A9,Macronutrients,6,FALSE)*$E$9+VLOOKUP($A10,Macronutrients,6,FALSE)*$E$10+VLOOKUP($A11,Macronutrients,6,FALSE)*$E$11+VLOOKUP($A14,Micronutrients,6,FALSE)*$E$14+VLOOKUP($A15,Micronutrients,6,FALSE)*AC15+VLOOKUP($A16,Micronutrients,6,FALSE)*$E$16+VLOOKUP($A17,Micronutrients,6,FALSE)*$E$17+VLOOKUP($A20,Lime,6,FALSE)*AC20","v":0}]
["None",0,0,1,0,0,0,null,null,null,null,null,"None",0,0,1,0,0,0,null,null,null,null,null,"None",0,0,1,0,0,0]
["None",0,0,1,0,0,0,null,"Z","B","Mn",null,"None",0,0,1,0,0,0,null,"Z","B","Mn",null,"None",0,0,1,0,0,0,null,"Z","B","Mn"]
[null,null,null,null,null,null,null,null,{"$f":"VLOOKUP(A6,Macronutrients,8,FALSE)*E6+VLOOKUP(A7,Macronutrients,8,FALSE)*E7+VLOOKUP(A8,Macronutrients,8,FALSE)*E8+VLOOKUP(A9,Macronutrients,8,FALSE)*E9+VLOOKUP(A10,Macronutrients,8,FALSE)*E10+VLOOKUP(A11,Macronutrients,8,FALSE)*E11+VLOOKUP(A14,Micronutrients,8,FALSE)*E14+VLOOKUP(A15,Micronutrients,8,FALSE)*E15+VLOOKUP(A16,Micronutrients,8,FALSE)*E16+VLOOKUP(A17,Micronutrients,8,FALSE)*E17+VLOOKUP(A20,Lime,8,FALSE)*E20","v":0},{"$f":"VLOOKUP(A6,Macronutrients,9,FALSE)*E6+VLOOKUP(A7,Macronutrients,9,FALSE)*E7+VLOOKUP(A8,Macronutrients,9,FALSE)*E8+VLOOKUP(A9,Macronutrients,9,FALSE)*E9+VLOOKUP(A10,Macronutrients,9,FALSE)*E10+VLOOKUP(A11,Macronutrients,9,FALSE)*E11+VLOOKUP(A14,Micronutrients,9,FALSE)*E14+VLOOKUP(A15,Micronutrients,9,FALSE)*E15+VLOOKUP(A16,Micronutrients,9,FALSE)*E16+VLOOKUP(A17,Micronutrients,9,FALSE)*E17+VLOOKUP(A20,Lime,9,FALSE)*E20","v":0},{"$f":"VLOOKUP(A6,Macronutrients,10,FALSE)*E6+VLOOKUP(A7,Macronutrients,10,FALSE)*E7+VLOOKUP(A8,Macronutrients,10,FALSE)*E8+VLOOKUP(A9,Macronutrients,10,FALSE)*E9+VLOOKUP(A10,Macronutrients,10,FALSE)*E10+VLOOKUP(A11,Macronutrients,10,FALSE)*E11+VLOOKUP(A14,Micronutrients,10,FALSE)*E14+VLOOKUP(A15,Micronutrients,10,FALSE)*E15+VLOOKUP(A16,Micronutrients,10,FALSE)*E16+VLOOKUP(A17,Micronutrients,10,FALSE)*E17+VLOOKUP(A20,Lime,10,FALSE)*E20","v":0},null,null,null,null,null,null,null,null,null,{"$f":"VLOOKUP(M6,Macronutrients,8,FALSE)*Q6+VLOOKUP(M7,Macronutrients,8,FALSE)*Q7+VLOOKUP(M8,Macronutrients,8,FALSE)*Q8+VLOOKUP(M9,Macronutrients,8,FALSE)*Q9+VLOOKUP(M10,Macronutrients,8,FALSE)*Q10+VLOOKUP(M11,Macronutrients,8,FALSE)*Q11+VLOOKUP(M14,Micronutrients,8,FALSE)*Q14+VLOOKUP(M15,Micronutrients,8,FALSE)*Q15+VLOOKUP(M16,Micronutrients,8,FALSE)*Q16+VLOOKUP(M17,Micronutrients,8,FALSE)*Q17+VLOOKUP(M20,Lime,8,FALSE)*Q20","v":0},{"$f":"VLOOKUP(M6,Macronutrients,9,FALSE)*Q6+VLOOKUP(M7,Macronutrients,9,FALSE)*Q7+VLOOKUP(M8,Macronutrients,9,FALSE)*Q8+VLOOKUP(M9,Macronutrients,9,FALSE)*Q9+VLOOKUP(M10,Macronutrients,9,FALSE)*Q10+VLOOKUP(M11,Macronutrients,9,FALSE)*Q11+VLOOKUP(M14,Micronutrients,9,FALSE)*Q14+VLOOKUP(M15,Micronutrients,9,FALSE)*Q15+VLOOKUP(M16,Micronutrients,9,FALSE)*Q16+VLOOKUP(M17,Micronutrients,9,FALSE)*Q17+VLOOKUP(M20,Lime,9,FALSE)*Q20","v":0},{"$f":"VLOOKUP(M6,Macronutrients,10,FALSE)*Q6+VLOOKUP(M7,Macronutrients,10,FALSE)*Q7+VLOOKUP(M8,Macronutrients,10,FALSE)*Q8+VLOOKUP(M9,Macronutrients,10,FALSE)*Q9+VLOOKUP(M10,Macronutrients,10,FALSE)*Q10+VLOOKUP(M11,Macronutrients,10,FALSE)*Q11+VLOOKUP(M14,Micronutrients,10,FALSE)*Q14+VLOOKUP(M15,Micronutrients,10,FALSE)*Q15+VLOOKUP(M16,Micronutrients,10,FALSE)*Q16+VLOOKUP(M17,Micronutrients,10,FALSE)*Q17+VLOOKUP(M20,Lime,10,FALSE)*Q20","v":0},null,null,null,null,null,null,null,null,null,{"$f":"VLOOKUP(Y6,Macronutrients,8,FALSE)*AC6+VLOOKUP(Y7,Macronutrients,8,FALSE)*AC7+VLOOKUP(Y8,Macronutrients,8,FALSE)*AC8+VLOOKUP(Y9,Macronutrients,8,FALSE)*AC9+VLOOKUP(Y10,Macronutrients,8,FALSE)*AC10+VLOOKUP(Y11,Macronutrients,8,FALSE)*AC11+VLOOKUP(Y14,Micronutrients,8,FALSE)*AC14+VLOOKUP(Y15,Micronutrients,8,FALSE)*AC15+VLOOKUP(Y16,Micronutrients,8,FALSE)*AC16+VLOOKUP(Y17,Micronutrients,8,FALSE)*AC17+VLOOKUP(Y20,Lime,8,FALSE)*AC20","v":0},{"$f":"VLOOKUP(Y6,Macronutrients,9,FALSE)*AC6+VLOOKUP(Y7,Macronutrients,9,FALSE)*AC7+VLOOKUP(Y8,Macronutrients,9,FALSE)*AC8+VLOOKUP(Y9,Macronutrients,9,FALSE)*AC9+VLOOKUP(Y10,Macronutrients,9,FALSE)*AC10+VLOOKUP(Y11,Macronutrients,9,FALSE)*AC11+VLOOKUP(Y14,Micronutrients,9,FALSE)*AC14+VLOOKUP(Y15,Micronutrients,9,FALSE)*AC15+VLOOKUP(Y16,Micronutrients,9,FALSE)*AC16+VLOOKUP(Y17,Micronutrients,9,FALSE)*AC17+VLOOKUP(Y20,Lime,9,FALSE)*AC20","v":0},{"$f":"VLOOKUP(Y6,Macronutrients,10,FALSE)*AC6+VLOOKUP(Y7,Macronutrients,10,FALSE)*AC7+VLOOKUP(Y8,Macronutrients,10,FALSE)*AC8+VLOOKUP(Y9,Macronutrients,10,FALSE)*AC9+VLOOKUP(Y10,Macronutrients,10,FALSE)*AC10+VLOOKUP(Y11,Macronutrients,10,FALSE)*AC11+VLOOKUP(Y14,Micronutrients,10,FALSE)*AC14+VLOOKUP(Y15,Micronutrients,10,FALSE)*AC15+VLOOKUP(Y16,Micronutrients,10,FALSE)*AC16+VLOOKUP(Y17,Micronutrients,10,FALSE)*AC17+VLOOKUP(Y20,Lime,10,FALSE)*AC20","v":0}]
["Micronutrients (drop down menu)",null,null,null,null,null,null,null,null,null,null,null,"Micronutrients (drop down menu)",null,null,null,null,null,null,null,null,null,null,null,"Micronutrients (drop down menu)"]
["None",{"$f":"VLOOKUP($A14,Micronutrients,14,FALSE)","v":0},{"$f":"VLOOKUP(A14,Micronutrients,18,FALSE)","v":0},{"$f":"VLOOKUP(A14,Micronutrients,16,FALSE)","v":1},0,{"$f":"VLOOKUP(A14,Micronutrients,15,FALSE)","v":0},{"$f":"(E14*VLOOKUP(A14,Micronutrients,14,FALSE)/D14)*C14","v":0},null,"Cu","Mo","Fe",null,"None",{"$f":"VLOOKUP(M14,Micronutrients,14,FALSE)","v":0},{"$f":"VLOOKUP(M14,Micronutrients,18,FALSE)","v":0},{"$f":"VLOOKUP(M14,Micronutrients,16,FALSE)","v":1},0,{"$f":"VLOOKUP(M14,Micronutrients,15,FALSE)","v":0},{"$f":"(Q14*VLOOKUP(M14,Micronutrients,14,FALSE)/P14)*O14","v":0},null,"Cu","Mo","Fe",null,"None",{"$f":"VLOOKUP(Y14,Micronutrients,14,FALSE)","v":0},{"$f":"VLOOKUP(Y14,Micronutrients,18,FALSE)","v":0},{"$f":"VLOOKUP(Y14,Micronutrients,16,FALSE)","v":1},0,{"$f":"VLOOKUP(Y14,Micronutrients,15,FALSE)","v":0},{"$f":"(AC14*VLOOKUP(Y14,Micronutrients,14,FALSE)/AB14)*AA14","v":0},null,"Cu","Mo","Fe"]
["None",{"$f":"VLOOKUP($A15,Micronutrients,14,FALSE)","v":0},{"$f":"VLOOKUP(A15,Micronutrients,18,FALSE)","v":0},{"$f":"VLOOKUP(A15,Micronutrients,16,FALSE)","v":1},0,{"$f":"VLOOKUP(A15,Micronutrients,15,FALSE)","v":0},{"$f":"(E15*VLOOKUP(A15,Micronutrients,14,FALSE)/D15)*C15","v":0},null,{"$f":"VLOOKUP(A6,Macronutrients,11,FALSE)*E6+VLOOKUP(A7,Macronutrients,11,FALSE)*E7+VLOOKUP(A8,Macronutrients,11,FALSE)*E8+VLOOKUP(A9,Macronutrients,11,FALSE)*E9+VLOOKUP(A10,Macronutrients,11,FALSE)*E10+VLOOKUP(A11,Macronutrients,11,FALSE)*E11+VLOOKUP(A14,Micronutrients,11,FALSE)*E14+VLOOKUP(A15,Micronutrients,11,FALSE)*E15+VLOOKUP(A16,Micronutrients,11,FALSE)*E16+VLOOKUP(A17,Micronutrients,11,FALSE)*E17+VLOOKUP(A20,Lime,11,FALSE)*E20","v":0},{"$f":"VLOOKUP(A6,Macronutrients,12,FALSE)*E6+VLOOKUP(A7,Macronutrients,12,FALSE)*E7+VLOOKUP(A8,Macronutrients,12,FALSE)*E8+VLOOKUP(A9,Macronutrients,12,FALSE)*E9+VLOOKUP(A10,Macronutrients,12,FALSE)*E10+VLOOKUP(A11,Macronutrients,12,FALSE)*E11+VLOOKUP(A14,Micronutrients,12,FALSE)*E14+VLOOKUP(A15,Micronutrients,12,FALSE)*E15+VLOOKUP(A16,Micronutrients,12,FALSE)*E16+VLOOKUP(A17,Micronutrients,12,FALSE)*E17+VLOOKUP(A20,Lime,12,FALSE)*E20","v":0},{"$f":"VLOOKUP(A6,Macronutrients,13,FALSE)*E6+VLOOKUP(A7,Macronutrients,13,FALSE)*E7+VLOOKUP(A8,Macronutrients,13,FALSE)*E8+VLOOKUP(A9,Macronutrients,13,FALSE)*E9+VLOOKUP(A10,Macronutrients,13,FALSE)*E10+VLOOKUP(A11,Macronutrients,13,FALSE)*E11+VLOOKUP(A14,Micronutrients,13,FALSE)*E14+VLOOKUP(A15,Micronutrients,13,FALSE)*E15+VLOOKUP(A16,Micronutrients,13,FALSE)*E16+VLOOKUP(A17,Micronutrients,13,FALSE)*E17+VLOOKUP(A20,Lime,13,FALSE)*E20","v":0},null,"None",{"$f":"VLOOKUP(M15,Micronutrients,14,FALSE)","v":0},{"$f":"VLOOKUP(M15,Micronutrients,18,FALSE)","v":0},{"$f":"VLOOKUP(M15,Micronutrients,16,FALSE)","v":1},0,{"$f":"VLOOKUP(M15,Micronutrients,15,FALSE)","v":0},{"$f":"(Q15*VLOOKUP(M15,Micronutrients,14,FALSE)/P15)*O15","v":0},null,{"$f":"VLOOKUP(M6,Macronutrients,11,FALSE)*Q6+VLOOKUP(M7,Macronutrients,11,FALSE)*Q7+VLOOKUP(M8,Macronutrients,11,FALSE)*Q8+VLOOKUP(M9,Macronutrients,11,FALSE)*Q9+VLOOKUP(M10,Macronutrients,11,FALSE)*Q10+VLOOKUP(M11,Macronutrients,11,FALSE)*Q11+VLOOKUP(M14,Micronutrients,11,FALSE)*Q14+VLOOKUP(M15,Micronutrients,11,FALSE)*Q15+VLOOKUP(M16,Micronutrients,11,FALSE)*Q16+VLOOKUP(M17,Micronutrients,11,FALSE)*Q17+VLOOKUP(M20,Lime,11,FALSE)*Q20","v":0},{"$f":"VLOOKUP(M6,Macronutrients,12,FALSE)*Q6+VLOOKUP(M7,Macronutrients,12,FALSE)*Q7+VLOOKUP(M8,Macronutrients,12,FALSE)*Q8+VLOOKUP(M9,Macronutrients,12,FALSE)*Q9+VLOOKUP(M10,Macronutrients,12,FALSE)*Q10+VLOOKUP(M11,Macronutrients,12,FALSE)*Q11+VLOOKUP(M14,Micronutrients,12,FALSE)*Q14+VLOOKUP(M15,Micronutrients,12,FALSE)*Q15+VLOOKUP(M16,Micronutrients,12,FALSE)*Q16+VLOOKUP(M17,Micronutrients,12,FALSE)*Q17+VLOOKUP(M20,Lime,12,FALSE)*Q20","v":0},{"$f":"VLOOKUP(M6,Macronutrients,13,FALSE)*Q6+VLOOKUP(M7,Macronutrients,13,FALSE)*Q7+VLOOKUP(M8,Macronutrients,13,FALSE)*Q8+VLOOKUP(M9,Macronutrients,13,FALSE)*Q9+VLOOKUP(M10,Macronutrients,13,FALSE)*Q10+VLOOKUP(M11,Macronutrients,13,FALSE)*Q11+VLOOKUP(M14,Micronutrients,13,FALSE)*Q14+VLOOKUP(M15,Micronutrients,13,FALSE)*Q15+VLOOKUP(M16,Micronutrients,13,FALSE)*Q16+VLOOKUP(M17,Micronutrients,13,FALSE)*Q17+VLOOKUP(M20,Lime,13,FALSE)*Q20","v":0},null,"None",{"$f":"VLOOKUP(Y15,Micronutrients,14,FALSE)","v":0},{"$f":"VLOOKUP(Y15,Micronutrients,18,FALSE)","v":0},{"$f":"VLOOKUP(Y15,Micronutrients,16,FALSE)","v":1},0,{"$f":"VLOOKUP(Y15,Micronutrients,15,FALSE)","v":0},{"$f":"(AC15*VLOOKUP(Y15,Micronutrients,14,FALSE)/AB15)*AA15","v":0},null,{"$f":"VLOOKUP(Y6,Macronutrients,11,FALSE)*AC6+VLOOKUP(Y7,Macronutrients,11,FALSE)*AC7+VLOOKUP(Y8,Macronutrients,11,FALSE)*AC8+VLOOKUP(Y9,Macronutrients,11,FALSE)*AC9+VLOOKUP(Y10,Macronutrients,11,FALSE)*AC10+VLOOKUP(Y11,Macronutrients,11,FALSE)*AC11+VLOOKUP(Y14,Micronutrients,11,FALSE)*AC14+VLOOKUP(Y15,Micronutrients,11,FALSE)*AC15+VLOOKUP(Y16,Micronutrients,11,FALSE)*AC16+VLOOKUP(Y17,Micronutrients,11,FALSE)*AC17+VLOOKUP(Y20,Lime,11,FALSE)*AC20","v":0},{"$f":"VLOOKUP(Y6,Macronutrients,12,FALSE)*AC6+VLOOKUP(Y7,Macronutrients,12,FALSE)*AC7+VLOOKUP(Y8,Macronutrients,12,FALSE)*AC8+VLOOKUP(Y9,Macronutrients,12,FALSE)*AC9+VLOOKUP(Y10,Macronutrients,12,FALSE)*AC10+VLOOKUP(Y11,Macronutrients,12,FALSE)*AC11+VLOOKUP(Y14,Micronutrients,12,FALSE)*AC14+VLOOKUP(Y15,Micronutrients,12,FALSE)*AC15+VLOOKUP(Y16,Micronutrients,12,FALSE)*AC16+VLOOKUP(Y17,Micronutrients,12,FALSE)*AC17+VLOOKUP(Y20,Lime,12,FALSE)*AC20","v":0},{"$f":"VLOOKUP(Y6,Macronutrients,13,FALSE)*AC6+VLOOKUP(Y7,Macronutrients,13,FALSE)*AC7+VLOOKUP(Y8,Macronutrients,13,FALSE)*AC8+VLOOKUP(Y9,Macronutrients,13,FALSE)*AC9+VLOOKUP(Y10,Macronutrients,13,FALSE)*AC10+VLOOKUP(Y11,Macronutrients,13,FALSE)*AC11+VLOOKUP(Y14,Micronutrients,13,FALSE)*AC14+VLOOKUP(Y15,Micronutrients,13,FALSE)*AC15+VLOOKUP(Y16,Micronutrients,13,FALSE)*AC16+VLOOKUP(Y17,Micronutrients,13,FALSE)*AC17+VLOOKUP(Y20,Lime,13,FALSE)*AC20","v":0}]
["None",{"$f":"VLOOKUP($A16,Micronutrients,14,FALSE)","v":0},{"$f":"VLOOKUP(A16,Micronutrients,18,FALSE)","v":0},{"$f":"VLOOKUP(A16,Micronutrients,16,FALSE)","v":1},0,{"$f":"VLOOKUP(A16,Micronutrients,15,FALSE)","v":0},{"$f":"(E16*VLOOKUP(A16,Micronutrients,14,FALSE)/D16)*C16","v":0},null,null,null,null,null,"None",{"$f":"VLOOKUP(M16,Micronutrients,14,FALSE)","v":0},{"$f":"VLOOKUP(M16,Micronutrients,18,FALSE)","v":0},{"$f":"VLOOKUP(M16,Micronutrients,16,FALSE)","v":1},0,{"$f":"VLOOKUP(M16,Micronutrients,15,FALSE)","v":0},{"$f":"(Q16*VLOOKUP(M16,Micronutrients,14,FALSE)/P16)*O16","v":0},null,null,null,null,null,"None",{"$f":"VLOOKUP(Y16,Micronutrients,14,FALSE)","v":0},{"$f":"VLOOKUP(Y16,Micronutrients,18,FALSE)","v":0},{"$f":"VLOOKUP(Y16,Micronutrients,16,FALSE)","v":1},0,{"$f":"'Nutrient Management'!C69","v":0},{"$f":"(AC16*VLOOKUP(Y16,Micronutrients,14,FALSE)/AB16)*AA16","v":0}]
["None",{"$f":"VLOOKUP($A17,Micronutrients,14,FALSE)","v":0},{"$f":"VLOOKUP(A17,Micronutrients,18,FALSE)","v":0},{"$f":"VLOOKUP(A17,Micronutrients,16,FALSE)","v":1},0,{"$f":"VLOOKUP(A17,Micronutrients,15,FALSE)","v":0},{"$f":"(E17*VLOOKUP(A17,Micronutrients,14,FALSE)/D17)*C17","v":0},null,null,null,null,null,"None",{"$f":"VLOOKUP(M17,Micronutrients,14,FALSE)","v":0},{"$f":"VLOOKUP(M17,Micronutrients,18,FALSE)","v":0},{"$f":"VLOOKUP(M17,Micronutrients,16,FALSE)","v":1},0,{"$f":"VLOOKUP(M17,Micronutrients,15,FALSE)","v":0},{"$f":"(Q17*VLOOKUP(M17,Micronutrients,14,FALSE)/P17)*O17","v":0},null,null,null,null,null,"None",{"$f":"VLOOKUP(Y17,Micronutrients,14,FALSE)","v":0},{"$f":"VLOOKUP(Y17,Micronutrients,18,FALSE)","v":0},{"$f":"VLOOKUP(Y17,Micronutrients,16,FALSE)","v":1},0,{"$f":"VLOOKUP(Y17,Micronutrients,15,FALSE)","v":0},{"$f":"(AC17*VLOOKUP(Y17,Micronutrients,14,FALSE)/AB17)*AA17","v":0}]
[]
["Lime (drop down menu)",null,null,null,null,null,null,null,null,null,null,null,"Lime (drop down menu)",null,null,null,null,null,null,null,null,null,null,null,"Lime (drop down menu)"]
["None",{"$f":"VLOOKUP(A20,Lime,14,FALSE)","v":0},{"$f":"VLOOKUP(A20,Lime,18,FALSE)","v":0},{"$f":"VLOOKUP(A20,Lime,16,FALSE)","v":1},0,{"$f":"VLOOKUP(A20,Lime,15,FALSE)","v":0},{"$f":"(E20*VLOOKUP(A20,Lime,14,FALSE)/D20)*C20","v":0},null,null,null,null,null,"None",{"$f":"VLOOKUP(M20,Lime,14,FALSE)","v":0},{"$f":"VLOOKUP(M20,Lime,18,FALSE)","v":0},{"$f":"VLOOKUP(M20,Lime,16,FALSE)","v":1},0,{"$f":"VLOOKUP(M20,Lime,15,FALSE)","v":0},{"$f":"(Q20*VLOOKUP(M20,Lime,14,FALSE)/P20)*O20","v":0},null,null,null,null,null,"None",{"$f":"VLOOKUP(Y20,Lime,14,FALSE)","v":0},{"$f":"VLOOKUP(Y20,Lime,18,FALSE)","v":0},{"$f":"VLOOKUP(Y20,Lime,16,FALSE)","v":1},0,{"$f":"VLOOKUP(Y20,Lime,15,FALSE)","v":0},{"$f":"(AC20*VLOOKUP(Y20,Lime,14,FALSE)/AB20)*AA20","v":0}]
[]
["Nitrogen Stabilizers (drop down menu)",null,null,null,null,null,null,null,null,null,null,null,"Nitrogen Stabilizers (drop down menu)",null,null,null,null,null,null,null,null,null,null,null,"Nitrogen Stabilizers (drop down menu)"]
["None",{"$f":"VLOOKUP(A23,NitrogenStabilizers,14,FALSE)","v":0},{"$f":"VLOOKUP(A23,NitrogenStabilizers,18,FALSE)","v":0},{"$f":"VLOOKUP(A23,NitrogenStabilizers,16,FALSE)","v":1},0,{"$f":"VLOOKUP(A23,NitrogenStabilizers,15,FALSE)","v":0},{"$f":"(E23*VLOOKUP(A23,NitrogenStabilizers,14,FALSE)/D23)*C23","v":0},null,null,null,null,null,"None",{"$f":"VLOOKUP(M23,NitrogenStabilizers,14,FALSE)","v":0},{"$f":"VLOOKUP(M23,NitrogenStabilizers,18,FALSE)","v":0},{"$f":"VLOOKUP(M23,NitrogenStabilizers,16,FALSE)","v":1},0,{"$f":"VLOOKUP(M23,NitrogenStabilizers,15,FALSE)","v":0},{"$f":"(Q23*VLOOKUP(M23,NitrogenStabilizers,14,FALSE)/P23)*O23","v":0},null,null,null,null,null,"None",{"$f":"VLOOKUP(Y23,NitrogenStabilizers,14,FALSE)","v":0},{"$f":"VLOOKUP(Y23,NitrogenStabilizers,18,FALSE)","v":0},{"$f":"VLOOKUP(Y23,NitrogenStabilizers,16,FALSE)","v":1},0,{"$f":"VLOOKUP(Y23,NitrogenStabilizers,15,FALSE)","v":0},{"$f":"(AC23*VLOOKUP(Y23,NitrogenStabilizers,14,FALSE)/AB23)*AA23","v":0}]
["None",{"$f":"VLOOKUP(A24,NitrogenStabilizers,14,FALSE)","v":0},{"$f":"VLOOKUP(A24,NitrogenStabilizers,18,FALSE)","v":0},{"$f":"VLOOKUP(A24,NitrogenStabilizers,16,FALSE)","v":1},0,{"$f":"VLOOKUP(A24,NitrogenStabilizers,15,FALSE)","v":0},{"$f":"(E24*VLOOKUP(A24,NitrogenStabilizers,14,FALSE)/D24)*C24","v":0},null,null,null,null,null,"None",{"$f":"VLOOKUP(M24,NitrogenStabilizers,14,FALSE)","v":0},{"$f":"VLOOKUP(M24,NitrogenStabilizers,18,FALSE)","v":0},{"$f":"VLOOKUP(M24,NitrogenStabilizers,16,FALSE)","v":1},0,{"$f":"VLOOKUP(M24,NitrogenStabilizers,15,FALSE)","v":0},{"$f":"(Q24*VLOOKUP(M24,NitrogenStabilizers,14,FALSE)/P24)*O24","v":0},null,null,null,null,null,"None",{"$f":"VLOOKUP(Y24,NitrogenStabilizers,14,FALSE)","v":0},{"$f":"VLOOKUP(Y24,NitrogenStabilizers,18,FALSE)","v":0},{"$f":"VLOOKUP(Y24,NitrogenStabilizers,16,FALSE)","v":1},0,{"$f":"VLOOKUP(Y24,NitrogenStabilizers,15,FALSE)","v":0},{"$f":"(AC24*VLOOKUP(Y24,NitrogenStabilizers,14,FALSE)/AB24)*AA24","v":0}]
["1st Application Fertilizer Cost/Acre",null,null,null,null,null,{"$f":"SUM(G6:G24)","v":0},null,null,null,null,null,"1st Application Fertilizer Cost/Acre",null,null,null,null,null,{"$f":"SUM(S6:S24)","v":0},null,null,null,null,null,"1st Application Fertilizer Cost/Acre",null,null,null,null,null,{"$f":"SUM(AE6:AE24)","v":0}]
[]
["2nd Application (i.e., Starter Fertilizer or Broadcast)",null,null,null,null,null,null,null,null,null,null,null,"2nd Application (i.e., Starter Fertilizer or Broadcast)",null,null,null,null,null,null,null,null,null,null,null,"2nd Application (i.e., Starter Fertilizer or Broadcast)"]
["Fertilizer Source","Purchase Units","Package Price (Gals, Lbs, etc.)","Units/Pkg","Rate/Acre","Units","Cost",null,null,null,null,null,"Fertilizer Source","Purchase Units","Package Price (Gals, Lbs, etc.)","Units/Pkg","Rate/Acre","Units","Cost",null,null,null,null,null,"Fertilizer Source","Purchase Units","Package Price (Gals, Lbs, etc.)","Units/Pkg","Rate/Acre","Units","Cost"]
["Macronutrients (drop down menu)",null,null,null,"(Enter Below)",null,null,null,"N","P","K",null,"Macronutrients (drop down menu)",null,null,null,"(Enter Below)",null,null,null,"N","P","K",null,"Macronutrients (drop down menu)",null,null,null,"(Enter Below)",null,null,null,"N","P","K"]
["None",{"$f":"VLOOKUP(A30,Macronutrients,14,FALSE)","v":0},{"$f":"VLOOKUP(A30,Macronutrients,18,FALSE)","v":0},{"$f":"VLOOKUP(A30,Macronutrients,16,FALSE)","v":1},0,{"$f":"VLOOKUP(A30,Macronutrients,15,FALSE)","v":0},{"$f":"(E30*VLOOKUP(A30,Macronutrients,14,FALSE)/D30)*C30","v":0},null,{"$f":"VLOOKUP(A30,Macronutrients,2,FALSE)*E30+VLOOKUP(A31,Macronutrients,2,FALSE)*E31+VLOOKUP(A32,Macronutrients,2,FALSE)*E32+VLOOKUP(A33,Macronutrients,2,FALSE)*E33+VLOOKUP(A34,Macronutrients,2,FALSE)*E34+VLOOKUP(A35,Macronutrients,2,FALSE)*E35+VLOOKUP(A38,Micronutrients,2,FALSE)*E38+VLOOKUP(A39,Micronutrients,2,FALSE)*E39+VLOOKUP(A40,Micronutrients,2,FALSE)*E40+VLOOKUP(A41,Micronutrients,2,FALSE)*E41","v":0},{"$f":"VLOOKUP(A30,Macronutrients,3,FALSE)*E30+VLOOKUP(A31,Macronutrients,3,FALSE)*E31+VLOOKUP(A32,Macronutrients,3,FALSE)*E32+VLOOKUP(A33,Macronutrients,3,FALSE)*E33+VLOOKUP(A34,Macronutrients,3,FALSE)*E34+VLOOKUP(A35,Macronutrients,3,FALSE)*E35+VLOOKUP(A38,Micronutrients,3,FALSE)*E38+VLOOKUP(A39,Micronutrients,3,FALSE)*E39+VLOOKUP(A40,Micronutrients,3,FALSE)*E40+VLOOKUP(A41,Micronutrients,3,FALSE)*E41","v":0},{"$f":"VLOOKUP(A30,Macronutrients,4,FALSE)*E30+VLOOKUP(A31,Macronutrients,4,FALSE)*E31+VLOOKUP(A32,Macronutrients,4,FALSE)*E32+VLOOKUP(A33,Macronutrients,4,FALSE)*E33+VLOOKUP(A34,Macronutrients,4,FALSE)*E34+VLOOKUP(A35,Macronutrients,4,FALSE)*E35+VLOOKUP(A38,Micronutrients,4,FALSE)*E38+VLOOKUP(A39,Micronutrients,4,FALSE)*E39+VLOOKUP(A40,Micronutrients,4,FALSE)*E40+VLOOKUP(A41,Micronutrients,4,FALSE)*E41","v":0},null,"None",{"$f":"VLOOKUP(M30,Macronutrients,14,FALSE)","v":0},{"$f":"VLOOKUP(M30,Macronutrients,18,FALSE)","v":0},{"$f":"VLOOKUP(M30,Macronutrients,16,FALSE)","v":1},0,{"$f":"VLOOKUP(M30,Macronutrients,15,FALSE)","v":0},{"$f":"(Q30*VLOOKUP(M30,Macronutrients,14,FALSE)/P30)*O30","v":0},null,{"$f":"VLOOKUP(M30,Macronutrients,2,FALSE)*Q30+VLOOKUP(M31,Macronutrients,2,FALSE)*Q31+VLOOKUP(M32,Macronutrients,2,FALSE)*Q32+VLOOKUP(M33,Macronutrients,2,FALSE)*Q33+VLOOKUP(M34,Macronutrients,2,FALSE)*Q34+VLOOKUP(M35,Macronutrients,2,FALSE)*Q35+VLOOKUP(M38,Micronutrients,2,FALSE)*Q38+VLOOKUP(M39,Micronutrients,2,FALSE)*Q39+VLOOKUP(M40,Micronutrients,2,FALSE)*Q40+VLOOKUP(M41,Micronutrients,2,FALSE)*Q41","v":0},{"$f":"VLOOKUP(M30,Macronutrients,3,FALSE)*Q30+VLOOKUP(M31,Macronutrients,3,FALSE)*Q31+VLOOKUP(M32,Macronutrients,3,FALSE)*Q32+VLOOKUP(M33,Macronutrients,3,FALSE)*Q33+VLOOKUP(M34,Macronutrients,3,FALSE)*Q34+VLOOKUP(M35,Macronutrients,3,FALSE)*Q35+VLOOKUP(M38,Micronutrients,3,FALSE)*Q38+VLOOKUP(M39,Micronutrients,3,FALSE)*Q39+VLOOKUP(M40,Micronutrients,3,FALSE)*Q40+VLOOKUP(M41,Micronutrients,3,FALSE)*Q41","v":0},{"$f":"VLOOKUP(M30,Macronutrients,4,FALSE)*Q30+VLOOKUP(M31,Macronutrients,4,FALSE)*Q31+VLOOKUP(M32,Macronutrients,4,FALSE)*Q32+VLOOKUP(M33,Macronutrients,4,FALSE)*Q33+VLOOKUP(M34,Macronutrients,4,FALSE)*Q34+VLOOKUP(M35,Macronutrients,4,FALSE)*Q35+VLOOKUP(M38,Micronutrients,4,FALSE)*Q38+VLOOKUP(M39,Micronutrients,4,FALSE)*Q39+VLOOKUP(M40,Micronutrients,4,FALSE)*Q40+VLOOKUP(M41,Micronutrients,4,FALSE)*Q41","v":0},null,"None",{"$f":"VLOOKUP(Y30,Macronutrients,14,FALSE)","v":0},{"$f":"VLOOKUP(Y30,Macronutrients,18,FALSE)","v":0},{"$f":"VLOOKUP(Y30,Macronutrients,16,FALSE)","v":1},0,{"$f":"VLOOKUP(Y30,Macronutrients,15,FALSE)","v":0},{"$f":"(AC30*VLOOKUP(Y30,Macronutrients,14,FALSE)/AB30)*AA30","v":0},null,{"$f":"VLOOKUP(Y30,Macronutrients,2,FALSE)*AC30+VLOOKUP(Y31,Macronutrients,2,FALSE)*AC31+VLOOKUP(Y32,Macronutrients,2,FALSE)*AC32+VLOOKUP(Y33,Macronutrients,2,FALSE)*AC33+VLOOKUP(Y34,Macronutrients,2,FALSE)*AC34+VLOOKUP(Y35,Macronutrients,2,FALSE)*AC35+VLOOKUP(Y38,Micronutrients,2,FALSE)*AC38+VLOOKUP(Y39,Micronutrients,2,FALSE)*AC39+VLOOKUP(Y40,Micronutrients,2,FALSE)*AC40+VLOOKUP(Y41,Micronutrients,2,FALSE)*AC41","v":0},{"$f":"VLOOKUP(Y30,Macronutrients,3,FALSE)*AC30+VLOOKUP(Y31,Macronutrients,3,FALSE)*AC31+VLOOKUP(Y32,Macronutrients,3,FALSE)*AC32+VLOOKUP(Y33,Macronutrients,3,FALSE)*AC33+VLOOKUP(Y34,Macronutrients,3,FALSE)*AC34+VLOOKUP(Y35,Macronutrients,3,FALSE)*AC35+VLOOKUP(Y38,Micronutrients,3,FALSE)*AC38+VLOOKUP(Y39,Micronutrients,3,FALSE)*AC39+VLOOKUP(Y40,Micronutrients,3,FALSE)*AC40+VLOOKUP(Y41,Micronutrients,3,FALSE)*AC41","v":0},{"$f":"VLOOKUP(Y30,Macronutrients,4,FALSE)*AC30+VLOOKUP(Y31,Macronutrients,4,FALSE)*AC31+VLOOKUP(Y32,Macronutrients,4,FALSE)*AC32+VLOOKUP(Y33,Macronutrients,4,FALSE)*AC33+VLOOKUP(Y34,Macronutrients,4,FALSE)*AC34+VLOOKUP(Y35,Macronutrients,4,FALSE)*AC35+VLOOKUP(Y38,Micronutrients,4,FALSE)*AC38+VLOOKUP(Y39,Micronutrients,4,FALSE)*AC39+VLOOKUP(Y40,Micronutrients,4,FALSE)*AC40+VLOOKUP(Y41,Micronutrients,4,FALSE)*AC41","v":0}]
["None",0,0,1,0,0,0,null,null,null,null,null,"None",0,0,1,0,0,0,null,null,null,null,null,"None",0,0,1,0,0,0]
["None",0,0,1,0,0,0,null,"S","Ca","Mg",null,"None",0,0,1,0,0,0,null,"S","Ca","Mg",null,"None",0,0,1,0,0,0,null,"S","Ca","Mg"]
["None",0,0,1,0,0,0,null,{"$f":"VLOOKUP(A30,Macronutrients,5,FALSE)*E30+VLOOKUP(A31,Macronutrients,5,FALSE)*E31+VLOOKUP(A32,Macronutrients,5,FALSE)*E32+VLOOKUP(A33,Macronutrients,5,FALSE)*E33+VLOOKUP(A34,Macronutrients,5,FALSE)*E34+VLOOKUP(A35,Macronutrients,5,FALSE)*E35+VLOOKUP(A38,Micronutrients,5,FALSE)*E38+VLOOKUP(A39,Micronutrients,5,FALSE)*E39+VLOOKUP(A40,Micronutrients,5,FALSE)*E40+VLOOKUP(A41,Micronutrients,5,FALSE)*E41","v":0},{"$f":"VLOOKUP(A30,Macronutrients,7,FALSE)*E30+VLOOKUP(A31,Macronutrients,7,FALSE)*E31+VLOOKUP(A32,Macronutrients,7,FALSE)*E32+VLOOKUP(A33,Macronutrients,7,FALSE)*E33+VLOOKUP(A34,Macronutrients,7,FALSE)*E34+VLOOKUP(A35,Macronutrients,7,FALSE)*E35+VLOOKUP(A38,Micronutrients,7,FALSE)*E38+VLOOKUP(A39,Micronutrients,7,FALSE)*E39+VLOOKUP(A40,Micronutrients,7,FALSE)*E40+VLOOKUP(A41,Micronutrients,7,FALSE)*E41","v":0},{"$f":"VLOOKUP($A30,Macronutrients,6,FALSE)*$E$6+VLOOKUP($A31,Macronutrients,6,FALSE)*$E$7+VLOOKUP($A32,Macronutrients,6,FALSE)*$E$8+VLOOKUP($A33,Macronutrients,6,FALSE)*$E$9+VLOOKUP($A34,Macronutrients,6,FALSE)*$E$10+VLOOKUP($A35,Macronutrients,6,FALSE)*$E$11+VLOOKUP($A38,Micronutrients,6,FALSE)*$E$14+VLOOKUP($A39,Micronutrients,6,FALSE)*E39+VLOOKUP($A40,Micronutrients,6,FALSE)*$E$16+VLOOKUP($A41,Micronutrients,6,FALSE)*$E$17","v":0},null,"None",0,0,1,0,0,0,null,{"$f":"VLOOKUP(M30,Macronutrients,5,FALSE)*Q30+VLOOKUP(M31,Macronutrients,5,FALSE)*Q31+VLOOKUP(M32,Macronutrients,5,FALSE)*Q32+VLOOKUP(M33,Macronutrients,5,FALSE)*Q33+VLOOKUP(M34,Macronutrients,5,FALSE)*Q34+VLOOKUP(M35,Macronutrients,5,FALSE)*Q35+VLOOKUP(M38,Micronutrients,5,FALSE)*Q38+VLOOKUP(M39,Micronutrients,5,FALSE)*Q39+VLOOKUP(M40,Micronutrients,5,FALSE)*Q40+VLOOKUP(M41,Micronutrients,5,FALSE)*Q41","v":0},{"$f":"VLOOKUP(M30,Macronutrients,7,FALSE)*Q30+VLOOKUP(M31,Macronutrients,7,FALSE)*Q31+VLOOKUP(M32,Macronutrients,7,FALSE)*Q32+VLOOKUP(M33,Macronutrients,7,FALSE)*Q33+VLOOKUP(M34,Macronutrients,7,FALSE)*Q34+VLOOKUP(M35,Macronutrients,7,FALSE)*Q35+VLOOKUP(M38,Micronutrients,7,FALSE)*Q38+VLOOKUP(M39,Micronutrients,7,FALSE)*Q39+VLOOKUP(M40,Micronutrients,7,FALSE)*Q40+VLOOKUP(M41,Micronutrients,7,FALSE)*Q41","v":0},{"$f":"VLOOKUP($A30,Macronutrients,6,FALSE)*$E$6+VLOOKUP($A31,Macronutrients,6,FALSE)*$E$7+VLOOKUP($A32,Macronutrients,6,FALSE)*$E$8+VLOOKUP($A33,Macronutrients,6,FALSE)*$E$9+VLOOKUP($A34,Macronutrients,6,FALSE)*$E$10+VLOOKUP($A35,Macronutrients,6,FALSE)*$E$11+VLOOKUP($A38,Micronutrients,6,FALSE)*$E$14+VLOOKUP($A39,Micronutrients,6,FALSE)*Q39+VLOOKUP($A40,Micronutrients,6,FALSE)*$E$16+VLOOKUP($A41,Micronutrients,6,FALSE)*$E$17","v":0},null,"None",0,0,1,0,0,0,null,{"$f":"VLOOKUP(Y30,Macronutrients,5,FALSE)*AC30+VLOOKUP(Y31,Macronutrients,5,FALSE)*AC31+VLOOKUP(Y32,Macronutrients,5,FALSE)*AC32+VLOOKUP(Y33,Macronutrients,5,FALSE)*AC33+VLOOKUP(Y34,Macronutrients,5,FALSE)*AC34+VLOOKUP(Y35,Macronutrients,5,FALSE)*AC35+VLOOKUP(Y38,Micronutrients,5,FALSE)*AC38+VLOOKUP(Y39,Micronutrients,5,FALSE)*AC39+VLOOKUP(Y40,Micronutrients,5,FALSE)*AC40+VLOOKUP(Y41,Micronutrients,5,FALSE)*AC41","v":0},{"$f":"VLOOKUP(Y30,Macronutrients,7,FALSE)*AC30+VLOOKUP(Y31,Macronutrients,7,FALSE)*AC31+VLOOKUP(Y32,Macronutrients,7,FALSE)*AC32+VLOOKUP(Y33,Macronutrients,7,FALSE)*AC33+VLOOKUP(Y34,Macronutrients,7,FALSE)*AC34+VLOOKUP(Y35,Macronutrients,7,FALSE)*AC35+VLOOKUP(Y38,Micronutrients,7,FALSE)*AC38+VLOOKUP(Y39,Micronutrients,7,FALSE)*AC39+VLOOKUP(Y40,Micronutrients,7,FALSE)*AC40+VLOOKUP(Y41,Micronutrients,7,FALSE)*AC41","v":0},{"$f":"VLOOKUP($A30,Macronutrients,6,FALSE)*$E$6+VLOOKUP($A31,Macronutrients,6,FALSE)*$E$7+VLOOKUP($A32,Macronutrients,6,FALSE)*$E$8+VLOOKUP($A33,Macronutrients,6,FALSE)*$E$9+VLOOKUP($A34,Macronutrients,6,FALSE)*$E$10+VLOOKUP($A35,Macronutrients,6,FALSE)*$E$11+VLOOKUP($A38,Micronutrients,6,FALSE)*$E$14+VLOOKUP($A39,Micronutrients,6,FALSE)*AC39+VLOOKUP($A40,Micronutrients,6,FALSE)*$E$16+VLOOKUP($A41,Micronutrients,6,FALSE)*$E$17","v":0}]
["None",0,0,1,0,0,0,null,null,null,null,null,"None",0,0,1,0,0,0,null,null,null,null,null,"None",0,0,1,0,0,0]
["None",0,0,1,0,0,0,null,"Z","B","Mn",null,"None",0,0,1,0,0,0,null,"Z","B","Mn",null,"None",0,0,1,0,0,0,null,"Z","B","Mn"]
[null,null,null,null,null,null,null,null,{"$f":"VLOOKUP(A30,Macronutrients,8,FALSE)*E30+VLOOKUP(A31,Macronutrients,8,FALSE)*E31+VLOOKUP(A32,Macronutrients,8,FALSE)*E32+VLOOKUP(A33,Macronutrients,8,FALSE)*E33+VLOOKUP(A34,Macronutrients,8,FALSE)*E34+VLOOKUP(A35,Macronutrients,8,FALSE)*E35+VLOOKUP(A38,Micronutrients,8,FALSE)*E38+VLOOKUP(A39,Micronutrients,8,FALSE)*E39+VLOOKUP(A40,Micronutrients,8,FALSE)*E40+VLOOKUP(A41,Micronutrients,8,FALSE)*E41","v":0},{"$f":"VLOOKUP(A30,Macronutrients,9,FALSE)*E30+VLOOKUP(A31,Macronutrients,9,FALSE)*E31+VLOOKUP(A32,Macronutrients,9,FALSE)*E32+VLOOKUP(A33,Macronutrients,9,FALSE)*E33+VLOOKUP(A34,Macronutrients,9,FALSE)*E34+VLOOKUP(A35,Macronutrients,9,FALSE)*E35+VLOOKUP(A38,Micronutrients,9,FALSE)*E38+VLOOKUP(A39,Micronutrients,9,FALSE)*E39+VLOOKUP(A40,Micronutrients,9,FALSE)*E40+VLOOKUP(A41,Micronutrients,9,FALSE)*E41","v":0},{"$f":"VLOOKUP(A30,Macronutrients,10,FALSE)*E30+VLOOKUP(A31,Macronutrients,10,FALSE)*E31+VLOOKUP(A32,Macronutrients,10,FALSE)*E32+VLOOKUP(A33,Macronutrients,10,FALSE)*E33+VLOOKUP(A34,Macronutrients,10,FALSE)*E34+VLOOKUP(A35,Macronutrients,10,FALSE)*E35+VLOOKUP(A38,Micronutrients,10,FALSE)*E38+VLOOKUP(A39,Micronutrients,10,FALSE)*E39+VLOOKUP(A40,Micronutrients,10,FALSE)*E40+VLOOKUP(A41,Micronutrients,10,FALSE)*E41","v":0},null,null,null,null,null,null,null,null,null,{"$f":"VLOOKUP(M30,Macronutrients,8,FALSE)*Q30+VLOOKUP(M31,Macronutrients,8,FALSE)*Q31+VLOOKUP(M32,Macronutrients,8,FALSE)*Q32+VLOOKUP(M33,Macronutrients,8,FALSE)*Q33+VLOOKUP(M34,Macronutrients,8,FALSE)*Q34+VLOOKUP(M35,Macronutrients,8,FALSE)*Q35+VLOOKUP(M38,Micronutrients,8,FALSE)*Q38+VLOOKUP(M39,Micronutrients,8,FALSE)*Q39+VLOOKUP(M40,Micronutrients,8,FALSE)*Q40+VLOOKUP(M41,Micronutrients,8,FALSE)*Q41","v":0},{"$f":"VLOOKUP(M30,Macronutrients,9,FALSE)*Q30+VLOOKUP(M31,Macronutrients,9,FALSE)*Q31+VLOOKUP(M32,Macronutrients,9,FALSE)*Q32+VLOOKUP(M33,Macronutrients,9,FALSE)*Q33+VLOOKUP(M34,Macronutrients,9,FALSE)*Q34+VLOOKUP(M35,Macronutrients,9,FALSE)*Q35+VLOOKUP(M38,Micronutrients,9,FALSE)*Q38+VLOOKUP(M39,Micronutrients,9,FALSE)*Q39+VLOOKUP(M40,Micronutrients,9,FALSE)*Q40+VLOOKUP(M41,Micronutrients,9,FALSE)*Q41","v":0},{"$f":"VLOOKUP(M30,Macronutrients,10,FALSE)*Q30+VLOOKUP(M31,Macronutrients,10,FALSE)*Q31+VLOOKUP(M32,Macronutrients,10,FALSE)*Q32+VLOOKUP(M33,Macronutrients,10,FALSE)*Q33+VLOOKUP(M34,Macronutrients,10,FALSE)*Q34+VLOOKUP(M35,Macronutrients,10,FALSE)*Q35+VLOOKUP(M38,Micronutrients,10,FALSE)*Q38+VLOOKUP(M39,Micronutrients,10,FALSE)*Q39+VLOOKUP(M40,Micronutrients,10,FALSE)*Q40+VLOOKUP(M41,Micronutrients,10,FALSE)*Q41","v":0},null,null,null,null,null,null,null,null,null,{"$f":"VLOOKUP(Y30,Macronutrients,8,FALSE)*AC30+VLOOKUP(Y31,Macronutrients,8,FALSE)*AC31+VLOOKUP(Y32,Macronutrients,8,FALSE)*AC32+VLOOKUP(Y33,Macronutrients,8,FALSE)*AC33+VLOOKUP(Y34,Macronutrients,8,FALSE)*AC34+VLOOKUP(Y35,Macronutrients,8,FALSE)*AC35+VLOOKUP(Y38,Micronutrients,8,FALSE)*AC38+VLOOKUP(Y39,Micronutrients,8,FALSE)*AC39+VLOOKUP(Y40,Micronutrients,8,FALSE)*AC40+VLOOKUP(Y41,Micronutrients,8,FALSE)*AC41","v":0},{"$f":"VLOOKUP(Y30,Macronutrients,9,FALSE)*AC30+VLOOKUP(Y31,Macronutrients,9,FALSE)*AC31+VLOOKUP(Y32,Macronutrients,9,FALSE)*AC32+VLOOKUP(Y33,Macronutrients,9,FALSE)*AC33+VLOOKUP(Y34,Macronutrients,9,FALSE)*AC34+VLOOKUP(Y35,Macronutrients,9,FALSE)*AC35+VLOOKUP(Y38,Micronutrients,9,FALSE)*AC38+VLOOKUP(Y39,Micronutrients,9,FALSE)*AC39+VLOOKUP(Y40,Micronutrients,9,FALSE)*AC40+VLOOKUP(Y41,Micronutrients,9,FALSE)*AC41","v":0},{"$f":"VLOOKUP(Y30,Macronutrients,10,FALSE)*AC30+VLOOKUP(Y31,Macronutrients,10,FALSE)*AC31+VLOOKUP(Y32,Macronutrients,10,FALSE)*AC32+VLOOKUP(Y33,Macronutrients,10,FALSE)*AC33+VLOOKUP(Y34,Macronutrients,10,FALSE)*AC34+VLOOKUP(Y35,Macronutrients,10,FALSE)*AC35+VLOOKUP(Y38,Micronutrients,10,FALSE)*AC38+VLOOKUP(Y39,Micronutrients,10,FALSE)*AC39+VLOOKUP(Y40,Micronutrients,10,FALSE)*AC40+VLOOKUP(Y41,Micronutrients,10,FALSE)*AC41","v":0}]
["Micronutrients (drop down menu)",null,null,null,null,null,null,null,null,null,null,null,"Micronutrients (drop down menu)",null,null,null,null,null,null,null,null,null,null,null,"Micronutrients (drop down menu)"]
["None",{"$f":"VLOOKUP($A38,Micronutrients,14,FALSE)","v":0},{"$f":"VLOOKUP(A38,Micronutrients,18,FALSE)","v":0},{"$f":"VLOOKUP(A38,Micronutrients,16,FALSE)","v":1},0,{"$f":"VLOOKUP(A38,Micronutrients,15,FALSE)","v":0},{"$f":"(E38*VLOOKUP(A38,Micronutrients,14,FALSE)/D38)*C38","v":0},null,"Cu","Mo","Fe",null,"None",{"$f":"VLOOKUP($M38,Micronutrients,14,FALSE)","v":0},{"$f":"VLOOKUP(M38,Micronutrients,18,FALSE)","v":0},{"$f":"VLOOKUP(M38,Micronutrients,16,FALSE)","v":1},0,{"$f":"VLOOKUP(M38,Micronutrients,15,FALSE)","v":0},{"$f":"(Q38*VLOOKUP(M38,Micronutrients,14,FALSE)/P38)*O38","v":0},null,"Cu","Mo","Fe",null,"None",{"$f":"VLOOKUP(Y38,Micronutrients,14,FALSE)","v":0},{"$f":"VLOOKUP(Y38,Micronutrients,18,FALSE)","v":0},{"$f":"VLOOKUP(Y38,Micronutrients,16,FALSE)","v":1},0,{"$f":"VLOOKUP(Y38,Micronutrients,15,FALSE)","v":0},{"$f":"(AC38*VLOOKUP(Y38,Micronutrients,14,FALSE)/AB38)*AA38","v":0},null,"Cu","Mo","Fe"]
["None",{"$f":"VLOOKUP($A39,Micronutrients,14,FALSE)","v":0},{"$f":"VLOOKUP(A39,Micronutrients,18,FALSE)","v":0},{"$f":"VLOOKUP(A39,Micronutrients,16,FALSE)","v":1},0,{"$f":"VLOOKUP(A39,Micronutrients,15,FALSE)","v":0},{"$f":"(E39*VLOOKUP(A39,Micronutrients,14,FALSE)/D39)*C39","v":0},null,{"$f":"VLOOKUP(A30,Macronutrients,11,FALSE)*E30+VLOOKUP(A31,Macronutrients,11,FALSE)*E31+VLOOKUP(A32,Macronutrients,11,FALSE)*E32+VLOOKUP(A33,Macronutrients,11,FALSE)*E33+VLOOKUP(A34,Macronutrients,11,FALSE)*E34+VLOOKUP(A35,Macronutrients,11,FALSE)*E35+VLOOKUP(A38,Micronutrients,11,FALSE)*E38+VLOOKUP(A39,Micronutrients,11,FALSE)*E39+VLOOKUP(A40,Micronutrients,11,FALSE)*E40+VLOOKUP(A41,Micronutrients,11,FALSE)*E41","v":0},{"$f":"VLOOKUP(A30,Macronutrients,12,FALSE)*E30+VLOOKUP(A31,Macronutrients,12,FALSE)*E31+VLOOKUP(A32,Macronutrients,12,FALSE)*E32+VLOOKUP(A33,Macronutrients,12,FALSE)*E33+VLOOKUP(A34,Macronutrients,12,FALSE)*E34+VLOOKUP(A35,Macronutrients,12,FALSE)*E35+VLOOKUP(A38,Micronutrients,12,FALSE)*E38+VLOOKUP(A39,Micronutrients,12,FALSE)*E39+VLOOKUP(A40,Micronutrients,12,FALSE)*E40+VLOOKUP(A41,Micronutrients,12,FALSE)*E41","v":0},{"$f":"VLOOKUP(A30,Macronutrients,13,FALSE)*E30+VLOOKUP(A31,Macronutrients,13,FALSE)*E31+VLOOKUP(A32,Macronutrients,13,FALSE)*E32+VLOOKUP(A33,Macronutrients,13,FALSE)*E33+VLOOKUP(A34,Macronutrients,13,FALSE)*E34+VLOOKUP(A35,Macronutrients,13,FALSE)*E35+VLOOKUP(A38,Micronutrients,13,FALSE)*E38+VLOOKUP(A39,Micronutrients,13,FALSE)*E39+VLOOKUP(A40,Micronutrients,13,FALSE)*E40+VLOOKUP(A41,Micronutrients,13,FALSE)*E41","v":0},null,"None",{"$f":"VLOOKUP($M39,Micronutrients,14,FALSE)","v":0},{"$f":"VLOOKUP(M39,Micronutrients,18,FALSE)","v":0},{"$f":"VLOOKUP(M39,Micronutrients,16,FALSE)","v":1},0,{"$f":"VLOOKUP(M39,Micronutrients,15,FALSE)","v":0},{"$f":"(Q39*VLOOKUP(M39,Micronutrients,14,FALSE)/P39)*O39","v":0},null,{"$f":"VLOOKUP(M30,Macronutrients,11,FALSE)*Q30+VLOOKUP(M31,Macronutrients,11,FALSE)*Q31+VLOOKUP(M32,Macronutrients,11,FALSE)*Q32+VLOOKUP(M33,Macronutrients,11,FALSE)*Q33+VLOOKUP(M34,Macronutrients,11,FALSE)*Q34+VLOOKUP(M35,Macronutrients,11,FALSE)*Q35+VLOOKUP(M38,Micronutrients,11,FALSE)*Q38+VLOOKUP(M39,Micronutrients,11,FALSE)*Q39+VLOOKUP(M40,Micronutrients,11,FALSE)*Q40+VLOOKUP(M41,Micronutrients,11,FALSE)*Q41","v":0},{"$f":"VLOOKUP(M30,Macronutrients,12,FALSE)*Q30+VLOOKUP(M31,Macronutrients,12,FALSE)*Q31+VLOOKUP(M32,Macronutrients,12,FALSE)*Q32+VLOOKUP(M33,Macronutrients,12,FALSE)*Q33+VLOOKUP(M34,Macronutrients,12,FALSE)*Q34+VLOOKUP(M35,Macronutrients,12,FALSE)*Q35+VLOOKUP(M38,Micronutrients,12,FALSE)*Q38+VLOOKUP(M39,Micronutrients,12,FALSE)*Q39+VLOOKUP(M40,Micronutrients,12,FALSE)*Q40+VLOOKUP(M41,Micronutrients,12,FALSE)*Q41","v":0},{"$f":"VLOOKUP(M30,Macronutrients,13,FALSE)*Q30+VLOOKUP(M31,Macronutrients,13,FALSE)*Q31+VLOOKUP(M32,Macronutrients,13,FALSE)*Q32+VLOOKUP(M33,Macronutrients,13,FALSE)*Q33+VLOOKUP(M34,Macronutrients,13,FALSE)*Q34+VLOOKUP(M35,Macronutrients,13,FALSE)*Q35+VLOOKUP(M38,Micronutrients,13,FALSE)*Q38+VLOOKUP(M39,Micronutrients,13,FALSE)*Q39+VLOOKUP(M40,Micronutrients,13,FALSE)*Q40+VLOOKUP(M41,Micronutrients,13,FALSE)*Q41","v":0},null,"None",{"$f":"VLOOKUP(Y39,Micronutrients,14,FALSE)","v":0},{"$f":"VLOOKUP(Y39,Micronutrients,18,FALSE)","v":0},{"$f":"VLOOKUP(Y39,Micronutrients,16,FALSE)","v":1},0,{"$f":"VLOOKUP(Y39,Micronutrients,15,FALSE)","v":0},{"$f":"(AC39*VLOOKUP(Y39,Micronutrients,14,FALSE)/AB39)*AA39","v":0},null,{"$f":"VLOOKUP(Y30,Macronutrients,11,FALSE)*AC30+VLOOKUP(Y31,Macronutrients,11,FALSE)*AC31+VLOOKUP(Y32,Macronutrients,11,FALSE)*AC32+VLOOKUP(Y33,Macronutrients,11,FALSE)*AC33+VLOOKUP(Y34,Macronutrients,11,FALSE)*AC34+VLOOKUP(Y35,Macronutrients,11,FALSE)*AC35+VLOOKUP(Y38,Micronutrients,11,FALSE)*AC38+VLOOKUP(Y39,Micronutrients,11,FALSE)*AC39+VLOOKUP(Y40,Micronutrients,11,FALSE)*AC40+VLOOKUP(Y41,Micronutrients,11,FALSE)*AC41","v":0},{"$f":"VLOOKUP(Y30,Macronutrients,12,FALSE)*AC30+VLOOKUP(Y31,Macronutrients,12,FALSE)*AC31+VLOOKUP(Y32,Macronutrients,12,FALSE)*AC32+VLOOKUP(Y33,Macronutrients,12,FALSE)*AC33+VLOOKUP(Y34,Macronutrients,12,FALSE)*AC34+VLOOKUP(Y35,Macronutrients,12,FALSE)*AC35+VLOOKUP(Y38,Micronutrients,12,FALSE)*AC38+VLOOKUP(Y39,Micronutrients,12,FALSE)*AC39+VLOOKUP(Y40,Micronutrients,12,FALSE)*AC40+VLOOKUP(Y41,Micronutrients,12,FALSE)*AC41","v":0},{"$f":"VLOOKUP(Y30,Macronutrients,13,FALSE)*AC30+VLOOKUP(Y31,Macronutrients,13,FALSE)*AC31+VLOOKUP(Y32,Macronutrients,13,FALSE)*AC32+VLOOKUP(Y33,Macronutrients,13,FALSE)*AC33+VLOOKUP(Y34,Macronutrients,13,FALSE)*AC34+VLOOKUP(Y35,Macronutrients,13,FALSE)*AC35+VLOOKUP(Y38,Micronutrients,13,FALSE)*AC38+VLOOKUP(Y39,Micronutrients,13,FALSE)*AC39+VLOOKUP(Y40,Micronutrients,13,FALSE)*AC40+VLOOKUP(Y41,Micronutrients,13,FALSE)*AC41","v":0}]
["None",{"$f":"VLOOKUP($A40,Micronutrients,14,FALSE)","v":0},{"$f":"VLOOKUP(A40,Micronutrients,18,FALSE)","v":0},{"$f":"VLOOKUP(A40,Micronutrients,16,FALSE)","v":1},0,{"$f":"VLOOKUP(A40,Micronutrients,15,FALSE)","v":0},{"$f":"(E40*VLOOKUP(A40,Micronutrients,14,FALSE)/D40)*C40","v":0},null,null,null,null,null,"None",{"$f":"VLOOKUP($M40,Micronutrients,14,FALSE)","v":0},{"$f":"VLOOKUP(M40,Micronutrients,18,FALSE)","v":0},{"$f":"VLOOKUP(M40,Micronutrients,16,FALSE)","v":1},0,{"$f":"VLOOKUP(M40,Micronutrients,15,FALSE)","v":0},{"$f":"(Q40*VLOOKUP(M40,Micronutrients,14,FALSE)/P40)*O40","v":0},null,null,null,null,null,"None",{"$f":"VLOOKUP(Y40,Micronutrients,14,FALSE)","v":0},{"$f":"VLOOKUP(Y40,Micronutrients,18,FALSE)","v":0},{"$f":"VLOOKUP(Y40,Micronutrients,16,FALSE)","v":1},0,{"$f":"VLOOKUP(Y40,Micronutrients,15,FALSE)","v":0},{"$f":"(AC40*VLOOKUP(Y40,Micronutrients,14,FALSE)/AB40)*AA40","v":0}]
["None",{"$f":"VLOOKUP($A41,Micronutrients,14,FALSE)","v":0},{"$f":"VLOOKUP(A41,Micronutrients,18,FALSE)","v":0},{"$f":"VLOOKUP(A41,Micronutrients,16,FALSE)","v":1},0,{"$f":"VLOOKUP(A41,Micronutrients,15,FALSE)","v":0},{"$f":"(E41*VLOOKUP(A41,Micronutrients,14,FALSE)/D41)*C41","v":0},null,null,null,null,null,"None",{"$f":"VLOOKUP($M41,Micronutrients,14,FALSE)","v":0},{"$f":"VLOOKUP(M41,Micronutrients,18,FALSE)","v":0},{"$f":"VLOOKUP(M41,Micronutrients,16,FALSE)","v":1},0,{"$f":"VLOOKUP(M41,Micronutrients,15,FALSE)","v":0},{"$f":"(Q41*VLOOKUP(M41,Micronutrients,14,FALSE)/P41)*O41","v":0},null,null,null,null,null,"None",{"$f":"VLOOKUP(Y41,Micronutrients,14,FALSE)","v":0},{"$f":"VLOOKUP(Y41,Micronutrients,18,FALSE)","v":0},{"$f":"VLOOKUP(Y41,Micronutrients,16,FALSE)","v":1},0,{"$f":"VLOOKUP(Y41,Micronutrients,15,FALSE)","v":0},{"$f":"(AC41*VLOOKUP(Y41,Micronutrients,14,FALSE)/AB41)*AA41","v":0}]
[]
["Nitrogen Stabilizers (drop down menu)",null,null,null,null,null,null,null,null,null,null,null,"Nitrogen Stabilizers (drop down menu)",null,null,null,null,null,null,null,null,null,null,null,"Nitrogen Stabilizers (drop down menu)"]
["None",{"$f":"VLOOKUP(A44,NitrogenStabilizers,14,FALSE)","v":0},{"$f":"VLOOKUP(A44,NitrogenStabilizers,18,FALSE)","v":0},{"$f":"VLOOKUP(A44,NitrogenStabilizers,16,FALSE)","v":1},0,{"$f":"VLOOKUP(A44,NitrogenStabilizers,15,FALSE)","v":0},{"$f":"(E44*VLOOKUP(A44,NitrogenStabilizers,14,FALSE)/D44)*C44","v":0},null,null,null,null,null,"None",{"$f":"VLOOKUP(M44,NitrogenStabilizers,14,FALSE)","v":0},{"$f":"VLOOKUP(M44,NitrogenStabilizers,18,FALSE)","v":0},{"$f":"VLOOKUP(M44,NitrogenStabilizers,16,FALSE)","v":1},0,{"$f":"VLOOKUP(M44,NitrogenStabilizers,15,FALSE)","v":0},{"$f":"(Q44*VLOOKUP(M44,NitrogenStabilizers,14,FALSE)/P44)*O44","v":0},null,null,null,null,null,"None",{"$f":"VLOOKUP(Y44,NitrogenStabilizers,14,FALSE)","v":0},{"$f":"VLOOKUP(Y44,NitrogenStabilizers,18,FALSE)","v":0},{"$f":"VLOOKUP(Y44,NitrogenStabilizers,16,FALSE)","v":1},0,{"$f":"VLOOKUP(Y44,NitrogenStabilizers,15,FALSE)","v":0},{"$f":"(AC44*VLOOKUP(Y44,NitrogenStabilizers,14,FALSE)/AB44)*AA44","v":0}]
["None",{"$f":"VLOOKUP(A45,NitrogenStabilizers,14,FALSE)","v":0},{"$f":"VLOOKUP(A45,NitrogenStabilizers,18,FALSE)","v":0},{"$f":"VLOOKUP(A45,NitrogenStabilizers,16,FALSE)","v":1},0,{"$f":"VLOOKUP(A45,NitrogenStabilizers,15,FALSE)","v":0},{"$f":"(E45*VLOOKUP(A45,NitrogenStabilizers,14,FALSE)/D45)*C45","v":0},null,null,null,"More",null,"None",{"$f":"VLOOKUP(M45,NitrogenStabilizers,14,FALSE)","v":0},{"$f":"VLOOKUP(M45,NitrogenStabilizers,18,FALSE)","v":0},{"$f":"VLOOKUP(M45,NitrogenStabilizers,16,FALSE)","v":1},0,{"$f":"VLOOKUP(M45,NitrogenStabilizers,15,FALSE)","v":0},{"$f":"(Q45*VLOOKUP(M45,NitrogenStabilizers,14,FALSE)/P45)*O45","v":0},null,null,null,"More",null,"None",{"$f":"VLOOKUP(Y45,NitrogenStabilizers,14,FALSE)","v":0},{"$f":"VLOOKUP(Y45,NitrogenStabilizers,18,FALSE)","v":0},{"$f":"VLOOKUP(Y45,NitrogenStabilizers,16,FALSE)","v":1},0,{"$f":"VLOOKUP(Y45,NitrogenStabilizers,15,FALSE)","v":0},{"$f":"(AC45*VLOOKUP(Y45,NitrogenStabilizers,14,FALSE)/AB45)*AA45","v":0},null,null,null,"More"]
["2nd Application Fertilizer Cost/Acre",null,null,null,null,null,{"$f":"SUM(G30:G45)","v":0},null,null,null,"Below",null,"2nd Application Fertilizer Cost/Acre",null,null,null,null,null,{"$f":"SUM(S30:S45)","v":0},null,null,null,"Below",null,"2nd Application Fertilizer Cost/Acre",null,null,null,null,null,{"$f":"SUM(AE30:AE45)","v":0},null,null,null,"Below"]
[null,null,null,null,null,null,null,null,null,null,"¯",null,null,null,null,null,null,null,null,null,null,null,"¯",null,null,null,null,null,null,null,null,null,null,null,"¯"]
["3rd Application (i.e., Side-Dress or Broadcast or Fertigation)",null,null,null,null,null,null,null,null,null,null,null,"3rd Application (i.e., Side-Dress or Broadcast or Fertigation)",null,null,null,null,null,null,null,null,null,null,null,"3rd Application (i.e., Side-Dress or Broadcast or Fertigation)"]
["Fertilizer Source","Purchase Units","Package Price (Gals, Lbs, etc.)","Units/Pkg","Rate/Acre","Units","Cost",null,null,null,null,null,"Fertilizer Source","Purchase Units","Package Price (Gals, Lbs, etc.)","Units/Pkg","Rate/Acre","Units","Cost",null,null,null,null,null,"Fertilizer Source","Purchase Units","Package Price (Gals, Lbs, etc.)","Units/Pkg","Rate/Acre","Units","Cost"]
["Macronutrients (drop down menu)",null,null,null,"(Enter Below)",null,null,null,"N","P","K",null,"Macronutrients (drop down menu)",null,null,null,"(Enter Below)",null,null,null,"N","P","K",null,"Macronutrients (drop down menu)",null,null,null,"(Enter Below)",null,null,null,"N","P","K"]
["None",{"$f":"VLOOKUP(A51,Macronutrients,14,FALSE)","v":0},{"$f":"VLOOKUP(A51,Macronutrients,18,FALSE)","v":0},{"$f":"VLOOKUP(A51,Macronutrients,16,FALSE)","v":1},0,{"$f":"VLOOKUP(A51,Macronutrients,15,FALSE)","v":0},{"$f":"(E51*VLOOKUP(A51,Macronutrients,14,FALSE)/D51)*C51","v":0},null,{"$f":"VLOOKUP(A51,Macronutrients,2,FALSE)*E51+VLOOKUP(A52,Macronutrients,2,FALSE)*E52+VLOOKUP(A53,Macronutrients,2,FALSE)*E53+VLOOKUP(A54,Macronutrients,2,FALSE)*E54+VLOOKUP(A55,Macronutrients,2,FALSE)*E55+VLOOKUP(A56,Macronutrients,2,FALSE)*E56+VLOOKUP(A59,Micronutrients,2,FALSE)*E59+VLOOKUP(A60,Micronutrients,2,FALSE)*E60+VLOOKUP(A61,Micronutrients,2,FALSE)*E61+VLOOKUP(A62,Micronutrients,2,FALSE)*E62","v":0},{"$f":"VLOOKUP(A51,Macronutrients,3,FALSE)*E51+VLOOKUP(A52,Macronutrients,3,FALSE)*E52+VLOOKUP(A53,Macronutrients,3,FALSE)*E53+VLOOKUP(A54,Macronutrients,3,FALSE)*E54+VLOOKUP(A55,Macronutrients,3,FALSE)*E55+VLOOKUP(A56,Macronutrients,3,FALSE)*E56+VLOOKUP(A59,Micronutrients,3,FALSE)*E59+VLOOKUP(A60,Micronutrients,3,FALSE)*E60+VLOOKUP(A61,Micronutrients,3,FALSE)*E61+VLOOKUP(A62,Micronutrients,3,FALSE)*E62","v":0},{"$f":"VLOOKUP(A51,Macronutrients,4,FALSE)*E51+VLOOKUP(A52,Macronutrients,4,FALSE)*E52+VLOOKUP(A53,Macronutrients,4,FALSE)*E53+VLOOKUP(A54,Macronutrients,4,FALSE)*E54+VLOOKUP(A55,Macronutrients,4,FALSE)*E55+VLOOKUP(A56,Macronutrients,4,FALSE)*E56+VLOOKUP(A59,Micronutrients,4,FALSE)*E59+VLOOKUP(A60,Micronutrients,4,FALSE)*E60+VLOOKUP(A61,Micronutrients,4,FALSE)*E61+VLOOKUP(A62,Micronutrients,4,FALSE)*E62","v":0},null,"None",{"$f":"VLOOKUP(M51,Macronutrients,14,FALSE)","v":0},{"$f":"VLOOKUP(M51,Macronutrients,18,FALSE)","v":0},{"$f":"VLOOKUP(M51,Macronutrients,16,FALSE)","v":1},0,{"$f":"VLOOKUP(M51,Macronutrients,15,FALSE)","v":0},{"$f":"(Q51*VLOOKUP(M51,Macronutrients,14,FALSE)/P51)*O51","v":0},null,{"$f":"VLOOKUP(M51,Macronutrients,2,FALSE)*Q51+VLOOKUP(M52,Macronutrients,2,FALSE)*Q52+VLOOKUP(M53,Macronutrients,2,FALSE)*Q53+VLOOKUP(M54,Macronutrients,2,FALSE)*Q54+VLOOKUP(M55,Macronutrients,2,FALSE)*Q55+VLOOKUP(M56,Macronutrients,2,FALSE)*Q56+VLOOKUP(M59,Micronutrients,2,FALSE)*Q59+VLOOKUP(M60,Micronutrients,2,FALSE)*Q60+VLOOKUP(M61,Micronutrients,2,FALSE)*Q61+VLOOKUP(M62,Micronutrients,2,FALSE)*Q62","v":0},{"$f":"VLOOKUP(M51,Macronutrients,3,FALSE)*Q51+VLOOKUP(M52,Macronutrients,3,FALSE)*Q52+VLOOKUP(M53,Macronutrients,3,FALSE)*Q53+VLOOKUP(M54,Macronutrients,3,FALSE)*Q54+VLOOKUP(M55,Macronutrients,3,FALSE)*Q55+VLOOKUP(M56,Macronutrients,3,FALSE)*Q56+VLOOKUP(M59,Micronutrients,3,FALSE)*Q59+VLOOKUP(M60,Micronutrients,3,FALSE)*Q60+VLOOKUP(M61,Micronutrients,3,FALSE)*Q61+VLOOKUP(M62,Micronutrients,3,FALSE)*Q62","v":0},{"$f":"VLOOKUP(M51,Macronutrients,4,FALSE)*Q51+VLOOKUP(M52,Macronutrients,4,FALSE)*Q52+VLOOKUP(M53,Macronutrients,4,FALSE)*Q53+VLOOKUP(M54,Macronutrients,4,FALSE)*Q54+VLOOKUP(M55,Macronutrients,4,FALSE)*Q55+VLOOKUP(M56,Macronutrients,4,FALSE)*Q56+VLOOKUP(M59,Micronutrients,4,FALSE)*Q59+VLOOKUP(M60,Micronutrients,4,FALSE)*Q60+VLOOKUP(M61,Micronutrients,4,FALSE)*Q61+VLOOKUP(M62,Micronutrients,4,FALSE)*Q62","v":0},null,"None",{"$f":"VLOOKUP(Y51,Macronutrients,14,FALSE)","v":0},{"$f":"VLOOKUP(Y51,Macronutrients,18,FALSE)","v":0},{"$f":"VLOOKUP(Y51,Macronutrients,16,FALSE)","v":1},0,{"$f":"VLOOKUP(Y51,Macronutrients,15,FALSE)","v":0},{"$f":"(AC51*VLOOKUP(Y51,Macronutrients,14,FALSE)/AB51)*AA51","v":0},null,{"$f":"VLOOKUP(Y51,Macronutrients,2,FALSE)*AC51+VLOOKUP(Y52,Macronutrients,2,FALSE)*AC52+VLOOKUP(Y53,Macronutrients,2,FALSE)*AC53+VLOOKUP(Y54,Macronutrients,2,FALSE)*AC54+VLOOKUP(Y55,Macronutrients,2,FALSE)*AC55+VLOOKUP(Y56,Macronutrients,2,FALSE)*AC56+VLOOKUP(Y59,Micronutrients,2,FALSE)*AC59+VLOOKUP(Y60,Micronutrients,2,FALSE)*AC60+VLOOKUP(Y61,Micronutrients,2,FALSE)*AC61+VLOOKUP(Y62,Micronutrients,2,FALSE)*AC62","v":0},{"$f":"VLOOKUP(Y51,Macronutrients,3,FALSE)*AC51+VLOOKUP(Y52,Macronutrients,3,FALSE)*AC52+VLOOKUP(Y53,Macronutrients,3,FALSE)*AC53+VLOOKUP(Y54,Macronutrients,3,FALSE)*AC54+VLOOKUP(Y55,Macronutrients,3,FALSE)*AC55+VLOOKUP(Y56,Macronutrients,3,FALSE)*AC56+VLOOKUP(Y59,Micronutrients,3,FALSE)*AC59+VLOOKUP(Y60,Micronutrients,3,FALSE)*AC60+VLOOKUP(Y61,Micronutrients,3,FALSE)*AC61+VLOOKUP(Y62,Micronutrients,3,FALSE)*AC62","v":0},{"$f":"VLOOKUP(Y51,Macronutrients,4,FALSE)*AC51+VLOOKUP(Y52,Macronutrients,4,FALSE)*AC52+VLOOKUP(Y53,Macronutrients,4,FALSE)*AC53+VLOOKUP(Y54,Macronutrients,4,FALSE)*AC54+VLOOKUP(Y55,Macronutrients,4,FALSE)*AC55+VLOOKUP(Y56,Macronutrients,4,FALSE)*AC56+VLOOKUP(Y59,Micronutrients,4,FALSE)*AC59+VLOOKUP(Y60,Micronutrients,4,FALSE)*AC60+VLOOKUP(Y61,Micronutrients,4,FALSE)*AC61+VLOOKUP(Y62,Micronutrients,4,FALSE)*AC62","v":0}]
["None",0,0,1,0,0,0,null,null,null,null,null,"None",0,0,1,0,0,0,null,null,null,null,null,"None",0,0,1,0,0,0]
["None",0,0,1,0,0,0,null,"S","Ca","Mg",null,"None",0,0,1,0,0,0,null,"S","Ca","Mg",null,"None",0,0,1,0,0,0,null,"S","Ca","Mg"]
["None",0,0,1,0,0,0,null,{"$f":"VLOOKUP(A51,Macronutrients,5,FALSE)*E51+VLOOKUP(A52,Macronutrients,5,FALSE)*E52+VLOOKUP(A53,Macronutrients,5,FALSE)*E53+VLOOKUP(A54,Macronutrients,5,FALSE)*E54+VLOOKUP(A55,Macronutrients,5,FALSE)*E55+VLOOKUP(A56,Macronutrients,5,FALSE)*E56+VLOOKUP(A59,Micronutrients,5,FALSE)*E59+VLOOKUP(A60,Micronutrients,5,FALSE)*E60+VLOOKUP(A61,Micronutrients,5,FALSE)*E61+VLOOKUP(A62,Micronutrients,5,FALSE)*E62","v":0},{"$f":"VLOOKUP(A51,Macronutrients,7,FALSE)*E51+VLOOKUP(A52,Macronutrients,7,FALSE)*E52+VLOOKUP(A53,Macronutrients,7,FALSE)*E53+VLOOKUP(A54,Macronutrients,7,FALSE)*E54+VLOOKUP(A55,Macronutrients,7,FALSE)*E55+VLOOKUP(A56,Macronutrients,7,FALSE)*E56+VLOOKUP(A59,Micronutrients,7,FALSE)*E59+VLOOKUP(A60,Micronutrients,7,FALSE)*E60+VLOOKUP(A61,Micronutrients,7,FALSE)*E61+VLOOKUP(A62,Micronutrients,7,FALSE)*E62","v":0},{"$f":"VLOOKUP($A51,Macronutrients,6,FALSE)*$E$6+VLOOKUP($A52,Macronutrients,6,FALSE)*$E$7+VLOOKUP($A53,Macronutrients,6,FALSE)*$E$8+VLOOKUP($A54,Macronutrients,6,FALSE)*$E$9+VLOOKUP($A55,Macronutrients,6,FALSE)*$E$10+VLOOKUP($A56,Macronutrients,6,FALSE)*$E$11+VLOOKUP($A59,Micronutrients,6,FALSE)*$E$14+VLOOKUP($A60,Micronutrients,6,FALSE)*E60+VLOOKUP($A61,Micronutrients,6,FALSE)*$E$16+VLOOKUP($A62,Micronutrients,6,FALSE)*$E$17","v":0},null,"None",0,0,1,0,0,0,null,{"$f":"VLOOKUP(M51,Macronutrients,5,FALSE)*Q51+VLOOKUP(M52,Macronutrients,5,FALSE)*Q52+VLOOKUP(M53,Macronutrients,5,FALSE)*Q53+VLOOKUP(M54,Macronutrients,5,FALSE)*Q54+VLOOKUP(M55,Macronutrients,5,FALSE)*Q55+VLOOKUP(M56,Macronutrients,5,FALSE)*Q56+VLOOKUP(M59,Micronutrients,5,FALSE)*Q59+VLOOKUP(M60,Micronutrients,5,FALSE)*Q60+VLOOKUP(M61,Micronutrients,5,FALSE)*Q61+VLOOKUP(M62,Micronutrients,5,FALSE)*Q62","v":0},{"$f":"VLOOKUP(M51,Macronutrients,7,FALSE)*Q51+VLOOKUP(M52,Macronutrients,7,FALSE)*Q52+VLOOKUP(M53,Macronutrients,7,FALSE)*Q53+VLOOKUP(M54,Macronutrients,7,FALSE)*Q54+VLOOKUP(M55,Macronutrients,7,FALSE)*Q55+VLOOKUP(M56,Macronutrients,7,FALSE)*Q56+VLOOKUP(M59,Micronutrients,7,FALSE)*Q59+VLOOKUP(M60,Micronutrients,7,FALSE)*Q60+VLOOKUP(M61,Micronutrients,7,FALSE)*Q61+VLOOKUP(M62,Micronutrients,7,FALSE)*Q62","v":0},{"$f":"VLOOKUP($A51,Macronutrients,6,FALSE)*$E$6+VLOOKUP($A52,Macronutrients,6,FALSE)*$E$7+VLOOKUP($A53,Macronutrients,6,FALSE)*$E$8+VLOOKUP($A54,Macronutrients,6,FALSE)*$E$9+VLOOKUP($A55,Macronutrients,6,FALSE)*$E$10+VLOOKUP($A56,Macronutrients,6,FALSE)*$E$11+VLOOKUP($A59,Micronutrients,6,FALSE)*$E$14+VLOOKUP($A60,Micronutrients,6,FALSE)*Q60+VLOOKUP($A61,Micronutrients,6,FALSE)*$E$16+VLOOKUP($A62,Micronutrients,6,FALSE)*$E$17","v":0},null,"None",0,0,1,0,0,0,null,{"$f":"VLOOKUP(Y51,Macronutrients,5,FALSE)*AC51+VLOOKUP(Y52,Macronutrients,5,FALSE)*AC52+VLOOKUP(Y53,Macronutrients,5,FALSE)*AC53+VLOOKUP(Y54,Macronutrients,5,FALSE)*AC54+VLOOKUP(Y55,Macronutrients,5,FALSE)*AC55+VLOOKUP(Y56,Macronutrients,5,FALSE)*AC56+VLOOKUP(Y59,Micronutrients,5,FALSE)*AC59+VLOOKUP(Y60,Micronutrients,5,FALSE)*AC60+VLOOKUP(Y61,Micronutrients,5,FALSE)*AC61+VLOOKUP(Y62,Micronutrients,5,FALSE)*AC62","v":0},{"$f":"VLOOKUP(Y51,Macronutrients,7,FALSE)*AC51+VLOOKUP(Y52,Macronutrients,7,FALSE)*AC52+VLOOKUP(Y53,Macronutrients,7,FALSE)*AC53+VLOOKUP(Y54,Macronutrients,7,FALSE)*AC54+VLOOKUP(Y55,Macronutrients,7,FALSE)*AC55+VLOOKUP(Y56,Macronutrients,7,FALSE)*AC56+VLOOKUP(Y59,Micronutrients,7,FALSE)*AC59+VLOOKUP(Y60,Micronutrients,7,FALSE)*AC60+VLOOKUP(Y61,Micronutrients,7,FALSE)*AC61+VLOOKUP(Y62,Micronutrients,7,FALSE)*AC62","v":0},{"$f":"VLOOKUP($A51,Macronutrients,6,FALSE)*$E$6+VLOOKUP($A52,Macronutrients,6,FALSE)*$E$7+VLOOKUP($A53,Macronutrients,6,FALSE)*$E$8+VLOOKUP($A54,Macronutrients,6,FALSE)*$E$9+VLOOKUP($A55,Macronutrients,6,FALSE)*$E$10+VLOOKUP($A56,Macronutrients,6,FALSE)*$E$11+VLOOKUP($A59,Micronutrients,6,FALSE)*$E$14+VLOOKUP($A60,Micronutrients,6,FALSE)*AC60+VLOOKUP($A61,Micronutrients,6,FALSE)*$E$16+VLOOKUP($A62,Micronutrients,6,FALSE)*$E$17","v":0}]
["None",0,0,1,0,0,0,null,null,null,null,null,"None",0,0,1,0,0,0,null,null,null,null,null,"None",0,0,1,0,0,0]
["None",0,0,1,0,0,0,null,"Z","B","Mn",null,"None",0,0,1,0,0,0,null,"Z","B","Mn",null,"None",0,0,1,0,0,0,null,"Z","B","Mn"]
[null,null,null,null,null,null,null,null,{"$f":"VLOOKUP(A51,Macronutrients,8,FALSE)*E51+VLOOKUP(A52,Macronutrients,8,FALSE)*E52+VLOOKUP(A53,Macronutrients,8,FALSE)*E53+VLOOKUP(A54,Macronutrients,8,FALSE)*E54+VLOOKUP(A55,Macronutrients,8,FALSE)*E55+VLOOKUP(A56,Macronutrients,8,FALSE)*E56+VLOOKUP(A59,Micronutrients,8,FALSE)*E59+VLOOKUP(A60,Micronutrients,8,FALSE)*E60+VLOOKUP(A61,Micronutrients,8,FALSE)*E61+VLOOKUP(A62,Micronutrients,8,FALSE)*E62","v":0},{"$f":"VLOOKUP(A51,Macronutrients,9,FALSE)*E51+VLOOKUP(A52,Macronutrients,9,FALSE)*E52+VLOOKUP(A53,Macronutrients,9,FALSE)*E53+VLOOKUP(A54,Macronutrients,9,FALSE)*E54+VLOOKUP(A55,Macronutrients,9,FALSE)*E55+VLOOKUP(A56,Macronutrients,9,FALSE)*E56+VLOOKUP(A59,Micronutrients,9,FALSE)*E59+VLOOKUP(A60,Micronutrients,9,FALSE)*E60+VLOOKUP(A61,Micronutrients,9,FALSE)*E61+VLOOKUP(A62,Micronutrients,9,FALSE)*E62","v":0},{"$f":"VLOOKUP(A51,Macronutrients,10,FALSE)*E51+VLOOKUP(A52,Macronutrients,10,FALSE)*E52+VLOOKUP(A53,Macronutrients,10,FALSE)*E53+VLOOKUP(A54,Macronutrients,10,FALSE)*E54+VLOOKUP(A55,Macronutrients,10,FALSE)*E55+VLOOKUP(A56,Macronutrients,10,FALSE)*E56+VLOOKUP(A59,Micronutrients,10,FALSE)*E59+VLOOKUP(A60,Micronutrients,10,FALSE)*E60+VLOOKUP(A61,Micronutrients,10,FALSE)*E61+VLOOKUP(A62,Micronutrients,10,FALSE)*E62","v":0},null,null,null,null,null,null,null,null,null,{"$f":"VLOOKUP(M51,Macronutrients,8,FALSE)*Q51+VLOOKUP(M52,Macronutrients,8,FALSE)*Q52+VLOOKUP(M53,Macronutrients,8,FALSE)*Q53+VLOOKUP(M54,Macronutrients,8,FALSE)*Q54+VLOOKUP(M55,Macronutrients,8,FALSE)*Q55+VLOOKUP(M56,Macronutrients,8,FALSE)*Q56+VLOOKUP(M59,Micronutrients,8,FALSE)*Q59+VLOOKUP(M60,Micronutrients,8,FALSE)*Q60+VLOOKUP(M61,Micronutrients,8,FALSE)*Q61+VLOOKUP(M62,Micronutrients,8,FALSE)*Q62","v":0},{"$f":"VLOOKUP(M51,Macronutrients,9,FALSE)*Q51+VLOOKUP(M52,Macronutrients,9,FALSE)*Q52+VLOOKUP(M53,Macronutrients,9,FALSE)*Q53+VLOOKUP(M54,Macronutrients,9,FALSE)*Q54+VLOOKUP(M55,Macronutrients,9,FALSE)*Q55+VLOOKUP(M56,Macronutrients,9,FALSE)*Q56+VLOOKUP(M59,Micronutrients,9,FALSE)*Q59+VLOOKUP(M60,Micronutrients,9,FALSE)*Q60+VLOOKUP(M61,Micronutrients,9,FALSE)*Q61+VLOOKUP(M62,Micronutrients,9,FALSE)*Q62","v":0},{"$f":"VLOOKUP(M51,Macronutrients,10,FALSE)*Q51+VLOOKUP(M52,Macronutrients,10,FALSE)*Q52+VLOOKUP(M53,Macronutrients,10,FALSE)*Q53+VLOOKUP(M54,Macronutrients,10,FALSE)*Q54+VLOOKUP(M55,Macronutrients,10,FALSE)*Q55+VLOOKUP(M56,Macronutrients,10,FALSE)*Q56+VLOOKUP(M59,Micronutrients,10,FALSE)*Q59+VLOOKUP(M60,Micronutrients,10,FALSE)*Q60+VLOOKUP(M61,Micronutrients,10,FALSE)*Q61+VLOOKUP(M62,Micronutrients,10,FALSE)*Q62","v":0},null,null,null,null,null,null,null,null,null,{"$f":"VLOOKUP(Y51,Macronutrients,8,FALSE)*AC51+VLOOKUP(Y52,Macronutrients,8,FALSE)*AC52+VLOOKUP(Y53,Macronutrients,8,FALSE)*AC53+VLOOKUP(Y54,Macronutrients,8,FALSE)*AC54+VLOOKUP(Y55,Macronutrients,8,FALSE)*AC55+VLOOKUP(Y56,Macronutrients,8,FALSE)*AC56+VLOOKUP(Y59,Micronutrients,8,FALSE)*AC59+VLOOKUP(Y60,Micronutrients,8,FALSE)*AC60+VLOOKUP(Y61,Micronutrients,8,FALSE)*AC61+VLOOKUP(Y62,Micronutrients,8,FALSE)*AC62","v":0},{"$f":"VLOOKUP(Y51,Macronutrients,9,FALSE)*AC51+VLOOKUP(Y52,Macronutrients,9,FALSE)*AC52+VLOOKUP(Y53,Macronutrients,9,FALSE)*AC53+VLOOKUP(Y54,Macronutrients,9,FALSE)*AC54+VLOOKUP(Y55,Macronutrients,9,FALSE)*AC55+VLOOKUP(Y56,Macronutrients,9,FALSE)*AC56+VLOOKUP(Y59,Micronutrients,9,FALSE)*AC59+VLOOKUP(Y60,Micronutrients,9,FALSE)*AC60+VLOOKUP(Y61,Micronutrients,9,FALSE)*AC61+VLOOKUP(Y62,Micronutrients,9,FALSE)*AC62","v":0},{"$f":"VLOOKUP(Y51,Macronutrients,10,FALSE)*AC51+VLOOKUP(Y52,Macronutrients,10,FALSE)*AC52+VLOOKUP(Y53,Macronutrients,10,FALSE)*AC53+VLOOKUP(Y54,Macronutrients,10,FALSE)*AC54+VLOOKUP(Y55,Macronutrients,10,FALSE)*AC55+VLOOKUP(Y56,Macronutrients,10,FALSE)*AC56+VLOOKUP(Y59,Micronutrients,10,FALSE)*AC59+VLOOKUP(Y60,Micronutrients,10,FALSE)*AC60+VLOOKUP(Y61,Micronutrients,10,FALSE)*AC61+VLOOKUP(Y62,Micronutrients,10,FALSE)*AC62","v":0}]
["Micronutrients (drop down menu)",null,null,null,null,null,null,null,null,null,null,null,"Micronutrients (drop down menu)",null,null,null,null,null,null,null,null,null,null,null,"Micronutrients (drop down menu)"]
["None",{"$f":"VLOOKUP($A59,Micronutrients,14,FALSE)","v":0},{"$f":"VLOOKUP(A59,Micronutrients,18,FALSE)","v":0},{"$f":"VLOOKUP(A59,Micronutrients,16,FALSE)","v":1},0,{"$f":"VLOOKUP(A59,Micronutrients,15,FALSE)","v":0},{"$f":"(E59*VLOOKUP(A59,Micronutrients,14,FALSE)/D59)*C59","v":0},null,"Cu","Mo","Fe",null,"None",{"$f":"VLOOKUP($M59,Micronutrients,14,FALSE)","v":0},{"$f":"VLOOKUP(M59,Micronutrients,18,FALSE)","v":0},{"$f":"VLOOKUP(M59,Micronutrients,16,FALSE)","v":1},0,{"$f":"VLOOKUP(M59,Micronutrients,15,FALSE)","v":0},{"$f":"(Q59*VLOOKUP(M59,Micronutrients,14,FALSE)/P59)*O59","v":0},null,"Cu","Mo","Fe",null,"None",{"$f":"VLOOKUP(Y59,Micronutrients,14,FALSE)","v":0},{"$f":"VLOOKUP(Y59,Micronutrients,18,FALSE)","v":0},{"$f":"VLOOKUP(Y59,Micronutrients,16,FALSE)","v":1},0,{"$f":"VLOOKUP(Y59,Micronutrients,15,FALSE)","v":0},{"$f":"(AC59*VLOOKUP(Y59,Micronutrients,14,FALSE)/AB59)*AA59","v":0},null,"Cu","Mo","Fe"]
["None",{"$f":"VLOOKUP($A60,Micronutrients,14,FALSE)","v":0},{"$f":"VLOOKUP(A60,Micronutrients,18,FALSE)","v":0},{"$f":"VLOOKUP(A60,Micronutrients,16,FALSE)","v":1},0,{"$f":"VLOOKUP(A60,Micronutrients,15,FALSE)","v":0},{"$f":"(E60*VLOOKUP(A60,Micronutrients,14,FALSE)/D60)*C60","v":0},null,{"$f":"VLOOKUP(A51,Macronutrients,11,FALSE)*E51+VLOOKUP(A52,Macronutrients,11,FALSE)*E52+VLOOKUP(A53,Macronutrients,11,FALSE)*E53+VLOOKUP(A54,Macronutrients,11,FALSE)*E54+VLOOKUP(A55,Macronutrients,11,FALSE)*E55+VLOOKUP(A56,Macronutrients,11,FALSE)*E56+VLOOKUP(A59,Micronutrients,11,FALSE)*E59+VLOOKUP(A60,Micronutrients,11,FALSE)*E60+VLOOKUP(A61,Micronutrients,11,FALSE)*E61+VLOOKUP(A62,Micronutrients,11,FALSE)*E62","v":0},{"$f":"VLOOKUP(A51,Macronutrients,12,FALSE)*E51+VLOOKUP(A52,Macronutrients,12,FALSE)*E52+VLOOKUP(A53,Macronutrients,12,FALSE)*E53+VLOOKUP(A54,Macronutrients,12,FALSE)*E54+VLOOKUP(A55,Macronutrients,12,FALSE)*E55+VLOOKUP(A56,Macronutrients,12,FALSE)*E56+VLOOKUP(A59,Micronutrients,12,FALSE)*E59+VLOOKUP(A60,Micronutrients,12,FALSE)*E60+VLOOKUP(A61,Micronutrients,12,FALSE)*E61+VLOOKUP(A62,Micronutrients,12,FALSE)*E62","v":0},{"$f":"VLOOKUP(A51,Macronutrients,13,FALSE)*E51+VLOOKUP(A52,Macronutrients,13,FALSE)*E52+VLOOKUP(A53,Macronutrients,13,FALSE)*E53+VLOOKUP(A54,Macronutrients,13,FALSE)*E54+VLOOKUP(A55,Macronutrients,13,FALSE)*E55+VLOOKUP(A56,Macronutrients,13,FALSE)*E56+VLOOKUP(A59,Micronutrients,13,FALSE)*E59+VLOOKUP(A60,Micronutrients,13,FALSE)*E60+VLOOKUP(A61,Micronutrients,13,FALSE)*E61+VLOOKUP(A62,Micronutrients,13,FALSE)*E62","v":0},null,"None",{"$f":"VLOOKUP($M60,Micronutrients,14,FALSE)","v":0},{"$f":"VLOOKUP(M60,Micronutrients,18,FALSE)","v":0},{"$f":"VLOOKUP(M60,Micronutrients,16,FALSE)","v":1},0,{"$f":"VLOOKUP(M60,Micronutrients,15,FALSE)","v":0},{"$f":"(Q60*VLOOKUP(M60,Micronutrients,14,FALSE)/P60)*O60","v":0},null,{"$f":"VLOOKUP(M51,Macronutrients,11,FALSE)*Q51+VLOOKUP(M52,Macronutrients,11,FALSE)*Q52+VLOOKUP(M53,Macronutrients,11,FALSE)*Q53+VLOOKUP(M54,Macronutrients,11,FALSE)*Q54+VLOOKUP(M55,Macronutrients,11,FALSE)*Q55+VLOOKUP(M56,Macronutrients,11,FALSE)*Q56+VLOOKUP(M59,Micronutrients,11,FALSE)*Q59+VLOOKUP(M60,Micronutrients,11,FALSE)*Q60+VLOOKUP(M61,Micronutrients,11,FALSE)*Q61+VLOOKUP(M62,Micronutrients,11,FALSE)*Q62","v":0},{"$f":"VLOOKUP(M51,Macronutrients,12,FALSE)*Q51+VLOOKUP(M52,Macronutrients,12,FALSE)*Q52+VLOOKUP(M53,Macronutrients,12,FALSE)*Q53+VLOOKUP(M54,Macronutrients,12,FALSE)*Q54+VLOOKUP(M55,Macronutrients,12,FALSE)*Q55+VLOOKUP(M56,Macronutrients,12,FALSE)*Q56+VLOOKUP(M59,Micronutrients,12,FALSE)*Q59+VLOOKUP(M60,Micronutrients,12,FALSE)*Q60+VLOOKUP(M61,Micronutrients,12,FALSE)*Q61+VLOOKUP(M62,Micronutrients,12,FALSE)*Q62","v":0},{"$f":"VLOOKUP(M51,Macronutrients,13,FALSE)*Q51+VLOOKUP(M52,Macronutrients,13,FALSE)*Q52+VLOOKUP(M53,Macronutrients,13,FALSE)*Q53+VLOOKUP(M54,Macronutrients,13,FALSE)*Q54+VLOOKUP(M55,Macronutrients,13,FALSE)*Q55+VLOOKUP(M56,Macronutrients,13,FALSE)*Q56+VLOOKUP(M59,Micronutrients,13,FALSE)*Q59+VLOOKUP(M60,Micronutrients,13,FALSE)*Q60+VLOOKUP(M61,Micronutrients,13,FALSE)*Q61+VLOOKUP(M62,Micronutrients,13,FALSE)*Q62","v":0},null,"None",{"$f":"VLOOKUP(Y60,Micronutrients,14,FALSE)","v":0},{"$f":"VLOOKUP(Y60,Micronutrients,18,FALSE)","v":0},{"$f":"VLOOKUP(Y60,Micronutrients,16,FALSE)","v":1},0,{"$f":"VLOOKUP(Y60,Micronutrients,15,FALSE)","v":0},{"$f":"(AC60*VLOOKUP(Y60,Micronutrients,14,FALSE)/AB60)*AA60","v":0},null,{"$f":"VLOOKUP(Y51,Macronutrients,11,FALSE)*AC51+VLOOKUP(Y52,Macronutrients,11,FALSE)*AC52+VLOOKUP(Y53,Macronutrients,11,FALSE)*AC53+VLOOKUP(Y54,Macronutrients,11,FALSE)*AC54+VLOOKUP(Y55,Macronutrients,11,FALSE)*AC55+VLOOKUP(Y56,Macronutrients,11,FALSE)*AC56+VLOOKUP(Y59,Micronutrients,11,FALSE)*AC59+VLOOKUP(Y60,Micronutrients,11,FALSE)*AC60+VLOOKUP(Y61,Micronutrients,11,FALSE)*AC61+VLOOKUP(Y62,Micronutrients,11,FALSE)*AC62","v":0},{"$f":"VLOOKUP(Y51,Macronutrients,12,FALSE)*AC51+VLOOKUP(Y52,Macronutrients,12,FALSE)*AC52+VLOOKUP(Y53,Macronutrients,12,FALSE)*AC53+VLOOKUP(Y54,Macronutrients,12,FALSE)*AC54+VLOOKUP(Y55,Macronutrients,12,FALSE)*AC55+VLOOKUP(Y56,Macronutrients,12,FALSE)*AC56+VLOOKUP(Y59,Micronutrients,12,FALSE)*AC59+VLOOKUP(Y60,Micronutrients,12,FALSE)*AC60+VLOOKUP(Y61,Micronutrients,12,FALSE)*AC61+VLOOKUP(Y62,Micronutrients,12,FALSE)*AC62","v":0},{"$f":"VLOOKUP(Y51,Macronutrients,13,FALSE)*AC51+VLOOKUP(Y52,Macronutrients,13,FALSE)*AC52+VLOOKUP(Y53,Macronutrients,13,FALSE)*AC53+VLOOKUP(Y54,Macronutrients,13,FALSE)*AC54+VLOOKUP(Y55,Macronutrients,13,FALSE)*AC55+VLOOKUP(Y56,Macronutrients,13,FALSE)*AC56+VLOOKUP(Y59,Micronutrients,13,FALSE)*AC59+VLOOKUP(Y60,Micronutrients,13,FALSE)*AC60+VLOOKUP(Y61,Micronutrients,13,FALSE)*AC61+VLOOKUP(Y62,Micronutrients,13,FALSE)*AC62","v":0}]
["None",{"$f":"VLOOKUP($A61,Micronutrients,14,FALSE)","v":0},{"$f":"VLOOKUP(A61,Micronutrients,18,FALSE)","v":0},{"$f":"VLOOKUP(A61,Micronutrients,16,FALSE)","v":1},0,{"$f":"VLOOKUP(A61,Micronutrients,15,FALSE)","v":0},{"$f":"(E61*VLOOKUP(A61,Micronutrients,14,FALSE)/D61)*C61","v":0},null,null,null,null,null,"None",{"$f":"VLOOKUP($M61,Micronutrients,14,FALSE)","v":0},{"$f":"VLOOKUP(M61,Micronutrients,18,FALSE)","v":0},{"$f":"VLOOKUP(M61,Micronutrients,16,FALSE)","v":1},0,{"$f":"VLOOKUP(M61,Micronutrients,15,FALSE)","v":0},{"$f":"(Q61*VLOOKUP(M61,Micronutrients,14,FALSE)/P61)*O61","v":0},null,null,null,null,null,"None",{"$f":"VLOOKUP(Y61,Micronutrients,14,FALSE)","v":0},{"$f":"VLOOKUP(Y61,Micronutrients,18,FALSE)","v":0},{"$f":"VLOOKUP(Y61,Micronutrients,16,FALSE)","v":1},0,{"$f":"VLOOKUP(Y61,Micronutrients,15,FALSE)","v":0},{"$f":"(AC61*VLOOKUP(Y61,Micronutrients,14,FALSE)/AB61)*AA61","v":0}]
["None",{"$f":"VLOOKUP($A62,Micronutrients,14,FALSE)","v":0},{"$f":"VLOOKUP(A62,Micronutrients,18,FALSE)","v":0},{"$f":"VLOOKUP(A62,Micronutrients,16,FALSE)","v":1},0,{"$f":"VLOOKUP(A62,Micronutrients,15,FALSE)","v":0},{"$f":"(E62*VLOOKUP(A62,Micronutrients,14,FALSE)/D62)*C62","v":0},null,null,null,null,null,"None",{"$f":"VLOOKUP($M62,Micronutrients,14,FALSE)","v":0},{"$f":"VLOOKUP(M62,Micronutrients,18,FALSE)","v":0},{"$f":"VLOOKUP(M62,Micronutrients,16,FALSE)","v":1},0,{"$f":"VLOOKUP(M62,Micronutrients,15,FALSE)","v":0},{"$f":"(Q62*VLOOKUP(M62,Micronutrients,14,FALSE)/P62)*O62","v":0},null,null,null,null,null,"None",{"$f":"VLOOKUP(Y62,Micronutrients,14,FALSE)","v":0},{"$f":"VLOOKUP(Y62,Micronutrients,18,FALSE)","v":0},{"$f":"VLOOKUP(Y62,Micronutrients,16,FALSE)","v":1},0,{"$f":"VLOOKUP(Y62,Micronutrients,15,FALSE)","v":0},{"$f":"(AC62*VLOOKUP(Y62,Micronutrients,14,FALSE)/AB62)*AA62","v":0}]
[]
["Nitrogen Stabilizers (drop down menu)",null,null,null,null,null,null,null,null,null,null,null,"Nitrogen Stabilizers (drop down menu)",null,null,null,null,null,null,null,null,null,null,null,"Nitrogen Stabilizers (drop down menu)"]
["None",{"$f":"VLOOKUP(A65,NitrogenStabilizers,14,FALSE)","v":0},{"$f":"VLOOKUP(A65,NitrogenStabilizers,18,FALSE)","v":0},{"$f":"VLOOKUP(A65,NitrogenStabilizers,16,FALSE)","v":1},0,{"$f":"VLOOKUP(A65,NitrogenStabilizers,15,FALSE)","v":0},{"$f":"(E65*VLOOKUP(A65,NitrogenStabilizers,14,FALSE)/D65)*C65","v":0},null,null,null,null,null,"None",{"$f":"VLOOKUP(M65,NitrogenStabilizers,14,FALSE)","v":0},{"$f":"VLOOKUP(M65,NitrogenStabilizers,18,FALSE)","v":0},{"$f":"VLOOKUP(M65,NitrogenStabilizers,16,FALSE)","v":1},0,{"$f":"VLOOKUP(M65,NitrogenStabilizers,15,FALSE)","v":0},{"$f":"(Q65*VLOOKUP(M65,NitrogenStabilizers,14,FALSE)/P65)*O65","v":0},null,null,null,null,null,"None",{"$f":"VLOOKUP(Y65,NitrogenStabilizers,14,FALSE)","v":0},{"$f":"VLOOKUP(Y65,NitrogenStabilizers,18,FALSE)","v":0},{"$f":"VLOOKUP(Y65,NitrogenStabilizers,16,FALSE)","v":1},0,{"$f":"VLOOKUP(Y65,NitrogenStabilizers,15,FALSE)","v":0},{"$f":"(AC65*VLOOKUP(Y65,NitrogenStabilizers,14,FALSE)/AB65)*AA65","v":0}]
["None",{"$f":"VLOOKUP(A66,NitrogenStabilizers,14,FALSE)","v":0},{"$f":"VLOOKUP(A66,NitrogenStabilizers,18,FALSE)","v":0},{"$f":"VLOOKUP(A66,NitrogenStabilizers,16,FALSE)","v":1},0,{"$f":"VLOOKUP(A66,NitrogenStabilizers,15,FALSE)","v":0},{"$f":"(E66*VLOOKUP(A66,NitrogenStabilizers,14,FALSE)/D66)*C66","v":0},null,null,null,"More",null,"None",{"$f":"VLOOKUP(M66,NitrogenStabilizers,14,FALSE)","v":0},{"$f":"VLOOKUP(M66,NitrogenStabilizers,18,FALSE)","v":0},{"$f":"VLOOKUP(M66,NitrogenStabilizers,16,FALSE)","v":1},0,{"$f":"VLOOKUP(M66,NitrogenStabilizers,15,FALSE)","v":0},{"$f":"(Q66*VLOOKUP(M66,NitrogenStabilizers,14,FALSE)/P66)*O66","v":0},null,null,null,"More",null,"None",{"$f":"VLOOKUP(Y66,NitrogenStabilizers,14,FALSE)","v":0},{"$f":"VLOOKUP(Y66,NitrogenStabilizers,18,FALSE)","v":0},{"$f":"VLOOKUP(Y66,NitrogenStabilizers,16,FALSE)","v":1},0,{"$f":"VLOOKUP(Y66,NitrogenStabilizers,15,FALSE)","v":0},{"$f":"(AC66*VLOOKUP(Y66,NitrogenStabilizers,14,FALSE)/AB66)*AA66","v":0},null,null,null,"More"]
["3rd Application Fertilizer Cost/Acre",null,null,null,null,null,{"$f":"SUM(G51:G66)","v":0},null,null,null,"Below",null,"3rd Application Fertilizer Cost/Acre",null,null,null,null,null,{"$f":"SUM(S51:S66)","v":0},null,null,null,"Below",null,"3rd Application Fertilizer Cost/Acre",null,null,null,null,null,{"$f":"SUM(AE51:AE66)","v":0},null,null,null,"Below"]
[null,null,null,null,null,null,null,null,null,null,"¯",null,null,null,null,null,null,null,null,null,null,null,"¯",null,null,null,null,null,null,null,null,null,null,null,"¯"]
["4th Application (i.e., Side-Dress or Broadcast or Fertigation)",null,null,null,null,null,null,null,null,null,null,null,"4th Application (i.e., Side-Dress or Broadcast or Fertigation)",null,null,null,null,null,null,null,null,null,null,null,"4th Application (i.e., Side-Dress or Broadcast or Fertigation)"]
["Fertilizer Source","Purchase Units","Package Price (Gals, Lbs, etc.)","Units/Pkg","Rate/Acre","Units","Cost",null,null,null,null,null,"Fertilizer Source","Purchase Units","Package Price (Gals, Lbs, etc.)","Units/Pkg","Rate/Acre","Units","Cost",null,null,null,null,null,"Fertilizer Source","Purchase Units","Package Price (Gals, Lbs, etc.)","Units/Pkg","Rate/Acre","Units","Cost"]
["Macronutrients (drop down menu)",null,null,null,"(Enter Below)",null,null,null,"N","P","K",null,"Macronutrients (drop down menu)",null,null,null,"(Enter Below)",null,null,null,"N","P","K",null,"Macronutrients (drop down menu)",null,null,null,"(Enter Below)",null,null,null,"N","P","K"]
["None",{"$f":"VLOOKUP(A72,Macronutrients,14,FALSE)","v":0},{"$f":"VLOOKUP(A72,Macronutrients,18,FALSE)","v":0},{"$f":"VLOOKUP(A72,Macronutrients,16,FALSE)","v":1},0,{"$f":"VLOOKUP(A72,Macronutrients,15,FALSE)","v":0},{"$f":"(E72*VLOOKUP(A72,Macronutrients,14,FALSE)/D72)*C72","v":0},null,{"$f":"VLOOKUP(A72,Macronutrients,2,FALSE)*E72+VLOOKUP(A73,Macronutrients,2,FALSE)*E73+VLOOKUP(A74,Macronutrients,2,FALSE)*E74+VLOOKUP(A75,Macronutrients,2,FALSE)*E75+VLOOKUP(A76,Macronutrients,2,FALSE)*E76+VLOOKUP(A77,Macronutrients,2,FALSE)*E77+VLOOKUP(A80,Micronutrients,2,FALSE)*E80+VLOOKUP(A81,Micronutrients,2,FALSE)*E81+VLOOKUP(A82,Micronutrients,2,FALSE)*E82+VLOOKUP(A83,Micronutrients,2,FALSE)*E83","v":0},{"$f":"VLOOKUP(A72,Macronutrients,3,FALSE)*E72+VLOOKUP(A73,Macronutrients,3,FALSE)*E73+VLOOKUP(A74,Macronutrients,3,FALSE)*E74+VLOOKUP(A75,Macronutrients,3,FALSE)*E75+VLOOKUP(A76,Macronutrients,3,FALSE)*E76+VLOOKUP(A77,Macronutrients,3,FALSE)*E77+VLOOKUP(A80,Micronutrients,3,FALSE)*E80+VLOOKUP(A81,Micronutrients,3,FALSE)*E81+VLOOKUP(A82,Micronutrients,3,FALSE)*E82+VLOOKUP(A83,Micronutrients,3,FALSE)*E83","v":0},{"$f":"VLOOKUP(A72,Macronutrients,4,FALSE)*E72+VLOOKUP(A73,Macronutrients,4,FALSE)*E73+VLOOKUP(A74,Macronutrients,4,FALSE)*E74+VLOOKUP(A75,Macronutrients,4,FALSE)*E75+VLOOKUP(A76,Macronutrients,4,FALSE)*E76+VLOOKUP(A77,Macronutrients,4,FALSE)*E77+VLOOKUP(A80,Micronutrients,4,FALSE)*E80+VLOOKUP(A81,Micronutrients,4,FALSE)*E81+VLOOKUP(A82,Micronutrients,4,FALSE)*E82+VLOOKUP(A83,Micronutrients,4,FALSE)*E83","v":0},null,"None",{"$f":"VLOOKUP(M72,Macronutrients,14,FALSE)","v":0},{"$f":"VLOOKUP(M72,Macronutrients,18,FALSE)","v":0},{"$f":"VLOOKUP(M72,Macronutrients,16,FALSE)","v":1},0,{"$f":"VLOOKUP(M72,Macronutrients,15,FALSE)","v":0},{"$f":"(Q72*VLOOKUP(M72,Macronutrients,14,FALSE)/P72)*O72","v":0},null,{"$f":"VLOOKUP(M72,Macronutrients,2,FALSE)*Q72+VLOOKUP(M73,Macronutrients,2,FALSE)*Q73+VLOOKUP(M74,Macronutrients,2,FALSE)*Q74+VLOOKUP(M75,Macronutrients,2,FALSE)*Q75+VLOOKUP(M76,Macronutrients,2,FALSE)*Q76+VLOOKUP(M77,Macronutrients,2,FALSE)*Q77+VLOOKUP(M80,Micronutrients,2,FALSE)*Q80+VLOOKUP(M81,Micronutrients,2,FALSE)*Q81+VLOOKUP(M82,Micronutrients,2,FALSE)*Q82+VLOOKUP(M83,Micronutrients,2,FALSE)*Q83","v":0},{"$f":"VLOOKUP(M72,Macronutrients,3,FALSE)*Q72+VLOOKUP(M73,Macronutrients,3,FALSE)*Q73+VLOOKUP(M74,Macronutrients,3,FALSE)*Q74+VLOOKUP(M75,Macronutrients,3,FALSE)*Q75+VLOOKUP(M76,Macronutrients,3,FALSE)*Q76+VLOOKUP(M77,Macronutrients,3,FALSE)*Q77+VLOOKUP(M80,Micronutrients,3,FALSE)*Q80+VLOOKUP(M81,Micronutrients,3,FALSE)*Q81+VLOOKUP(M82,Micronutrients,3,FALSE)*Q82+VLOOKUP(M83,Micronutrients,3,FALSE)*Q83","v":0},{"$f":"VLOOKUP(M72,Macronutrients,4,FALSE)*Q72+VLOOKUP(M73,Macronutrients,4,FALSE)*Q73+VLOOKUP(M74,Macronutrients,4,FALSE)*Q74+VLOOKUP(M75,Macronutrients,4,FALSE)*Q75+VLOOKUP(M76,Macronutrients,4,FALSE)*Q76+VLOOKUP(M77,Macronutrients,4,FALSE)*Q77+VLOOKUP(M80,Micronutrients,4,FALSE)*Q80+VLOOKUP(M81,Micronutrients,4,FALSE)*Q81+VLOOKUP(M82,Micronutrients,4,FALSE)*Q82+VLOOKUP(M83,Micronutrients,4,FALSE)*Q83","v":0},null,"None",{"$f":"VLOOKUP(Y72,Macronutrients,14,FALSE)","v":0},{"$f":"VLOOKUP(Y72,Macronutrients,18,FALSE)","v":0},{"$f":"VLOOKUP(Y72,Macronutrients,16,FALSE)","v":1},0,{"$f":"VLOOKUP(Y72,Macronutrients,15,FALSE)","v":0},{"$f":"(AC72*VLOOKUP(Y72,Macronutrients,14,FALSE)/AB72)*AA72","v":0},null,{"$f":"VLOOKUP(Y72,Macronutrients,2,FALSE)*AC72+VLOOKUP(Y73,Macronutrients,2,FALSE)*AC73+VLOOKUP(Y74,Macronutrients,2,FALSE)*AC74+VLOOKUP(Y75,Macronutrients,2,FALSE)*AC75+VLOOKUP(Y76,Macronutrients,2,FALSE)*AC76+VLOOKUP(Y77,Macronutrients,2,FALSE)*AC77+VLOOKUP(Y80,Micronutrients,2,FALSE)*AC80+VLOOKUP(Y81,Micronutrients,2,FALSE)*AC81+VLOOKUP(Y82,Micronutrients,2,FALSE)*AC82+VLOOKUP(Y83,Micronutrients,2,FALSE)*AC83","v":0},{"$f":"VLOOKUP(Y72,Macronutrients,3,FALSE)*AC72+VLOOKUP(Y73,Macronutrients,3,FALSE)*AC73+VLOOKUP(Y74,Macronutrients,3,FALSE)*AC74+VLOOKUP(Y75,Macronutrients,3,FALSE)*AC75+VLOOKUP(Y76,Macronutrients,3,FALSE)*AC76+VLOOKUP(Y77,Macronutrients,3,FALSE)*AC77+VLOOKUP(Y80,Micronutrients,3,FALSE)*AC80+VLOOKUP(Y81,Micronutrients,3,FALSE)*AC81+VLOOKUP(Y82,Micronutrients,3,FALSE)*AC82+VLOOKUP(Y83,Micronutrients,3,FALSE)*AC83","v":0},{"$f":"VLOOKUP(Y72,Macronutrients,4,FALSE)*AC72+VLOOKUP(Y73,Macronutrients,4,FALSE)*AC73+VLOOKUP(Y74,Macronutrients,4,FALSE)*AC74+VLOOKUP(Y75,Macronutrients,4,FALSE)*AC75+VLOOKUP(Y76,Macronutrients,4,FALSE)*AC76+VLOOKUP(Y77,Macronutrients,4,FALSE)*AC77+VLOOKUP(Y80,Micronutrients,4,FALSE)*AC80+VLOOKUP(Y81,Micronutrients,4,FALSE)*AC81+VLOOKUP(Y82,Micronutrients,4,FALSE)*AC82+VLOOKUP(Y83,Micronutrients,4,FALSE)*AC83","v":0}]
["None",0,0,1,0,0,0,null,null,null,null,null,"None",0,0,1,0,0,0,null,null,null,null,null,"None",0,0,1,0,0,0]
["None",0,0,1,0,0,0,null,"S","Ca","Mg",null,"None",0,0,1,0,0,0,null,"S","Ca","Mg",null,"None",0,0,1,0,0,0,null,"S","Ca","Mg"]
["None",0,0,1,0,0,0,null,{"$f":"VLOOKUP(A72,Macronutrients,5,FALSE)*E72+VLOOKUP(A73,Macronutrients,5,FALSE)*E73+VLOOKUP(A74,Macronutrients,5,FALSE)*E74+VLOOKUP(A75,Macronutrients,5,FALSE)*E75+VLOOKUP(A76,Macronutrients,5,FALSE)*E76+VLOOKUP(A77,Macronutrients,5,FALSE)*E77+VLOOKUP(A80,Micronutrients,5,FALSE)*E80+VLOOKUP(A81,Micronutrients,5,FALSE)*E81+VLOOKUP(A82,Micronutrients,5,FALSE)*E82+VLOOKUP(A83,Micronutrients,5,FALSE)*E83","v":0},{"$f":"VLOOKUP(A72,Macronutrients,7,FALSE)*E72+VLOOKUP(A73,Macronutrients,7,FALSE)*E73+VLOOKUP(A74,Macronutrients,7,FALSE)*E74+VLOOKUP(A75,Macronutrients,7,FALSE)*E75+VLOOKUP(A76,Macronutrients,7,FALSE)*E76+VLOOKUP(A77,Macronutrients,7,FALSE)*E77+VLOOKUP(A80,Micronutrients,7,FALSE)*E80+VLOOKUP(A81,Micronutrients,7,FALSE)*E81+VLOOKUP(A82,Micronutrients,7,FALSE)*E82+VLOOKUP(A83,Micronutrients,7,FALSE)*E83","v":0},{"$f":"VLOOKUP($A72,Macronutrients,6,FALSE)*$E$6+VLOOKUP($A73,Macronutrients,6,FALSE)*$E$7+VLOOKUP($A74,Macronutrients,6,FALSE)*$E$8+VLOOKUP($A75,Macronutrients,6,FALSE)*$E$9+VLOOKUP($A76,Macronutrients,6,FALSE)*$E$10+VLOOKUP($A77,Macronutrients,6,FALSE)*$E$11+VLOOKUP($A80,Micronutrients,6,FALSE)*$E$14+VLOOKUP($A81,Micronutrients,6,FALSE)*E81+VLOOKUP($A82,Micronutrients,6,FALSE)*$E$16+VLOOKUP($A83,Micronutrients,6,FALSE)*$E$17","v":0},null,"None",0,0,1,0,0,0,null,{"$f":"VLOOKUP(M72,Macronutrients,5,FALSE)*Q72+VLOOKUP(M73,Macronutrients,5,FALSE)*Q73+VLOOKUP(M74,Macronutrients,5,FALSE)*Q74+VLOOKUP(M75,Macronutrients,5,FALSE)*Q75+VLOOKUP(M76,Macronutrients,5,FALSE)*Q76+VLOOKUP(M77,Macronutrients,5,FALSE)*Q77+VLOOKUP(M80,Micronutrients,5,FALSE)*Q80+VLOOKUP(M81,Micronutrients,5,FALSE)*Q81+VLOOKUP(M82,Micronutrients,5,FALSE)*Q82+VLOOKUP(M83,Micronutrients,5,FALSE)*Q83","v":0},{"$f":"VLOOKUP(M72,Macronutrients,7,FALSE)*Q72+VLOOKUP(M73,Macronutrients,7,FALSE)*Q73+VLOOKUP(M74,Macronutrients,7,FALSE)*Q74+VLOOKUP(M75,Macronutrients,7,FALSE)*Q75+VLOOKUP(M76,Macronutrients,7,FALSE)*Q76+VLOOKUP(M77,Macronutrients,7,FALSE)*Q77+VLOOKUP(M80,Micronutrients,7,FALSE)*Q80+VLOOKUP(M81,Micronutrients,7,FALSE)*Q81+VLOOKUP(M82,Micronutrients,7,FALSE)*Q82+VLOOKUP(M83,Micronutrients,7,FALSE)*Q83","v":0},{"$f":"VLOOKUP($A72,Macronutrients,6,FALSE)*$E$6+VLOOKUP($A73,Macronutrients,6,FALSE)*$E$7+VLOOKUP($A74,Macronutrients,6,FALSE)*$E$8+VLOOKUP($A75,Macronutrients,6,FALSE)*$E$9+VLOOKUP($A76,Macronutrients,6,FALSE)*$E$10+VLOOKUP($A77,Macronutrients,6,FALSE)*$E$11+VLOOKUP($A80,Micronutrients,6,FALSE)*$E$14+VLOOKUP($A81,Micronutrients,6,FALSE)*Q81+VLOOKUP($A82,Micronutrients,6,FALSE)*$E$16+VLOOKUP($A83,Micronutrients,6,FALSE)*$E$17","v":0},null,"None",0,0,1,0,0,0,null,{"$f":"VLOOKUP(Y72,Macronutrients,5,FALSE)*AC72+VLOOKUP(Y73,Macronutrients,5,FALSE)*AC73+VLOOKUP(Y74,Macronutrients,5,FALSE)*AC74+VLOOKUP(Y75,Macronutrients,5,FALSE)*AC75+VLOOKUP(Y76,Macronutrients,5,FALSE)*AC76+VLOOKUP(Y77,Macronutrients,5,FALSE)*AC77+VLOOKUP(Y80,Micronutrients,5,FALSE)*AC80+VLOOKUP(Y81,Micronutrients,5,FALSE)*AC81+VLOOKUP(Y82,Micronutrients,5,FALSE)*AC82+VLOOKUP(Y83,Micronutrients,5,FALSE)*AC83","v":0},{"$f":"VLOOKUP(Y72,Macronutrients,7,FALSE)*AC72+VLOOKUP(Y73,Macronutrients,7,FALSE)*AC73+VLOOKUP(Y74,Macronutrients,7,FALSE)*AC74+VLOOKUP(Y75,Macronutrients,7,FALSE)*AC75+VLOOKUP(Y76,Macronutrients,7,FALSE)*AC76+VLOOKUP(Y77,Macronutrients,7,FALSE)*AC77+VLOOKUP(Y80,Micronutrients,7,FALSE)*AC80+VLOOKUP(Y81,Micronutrients,7,FALSE)*AC81+VLOOKUP(Y82,Micronutrients,7,FALSE)*AC82+VLOOKUP(Y83,Micronutrients,7,FALSE)*AC83","v":0},{"$f":"VLOOKUP($A72,Macronutrients,6,FALSE)*$E$6+VLOOKUP($A73,Macronutrients,6,FALSE)*$E$7+VLOOKUP($A74,Macronutrients,6,FALSE)*$E$8+VLOOKUP($A75,Macronutrients,6,FALSE)*$E$9+VLOOKUP($A76,Macronutrients,6,FALSE)*$E$10+VLOOKUP($A77,Macronutrients,6,FALSE)*$E$11+VLOOKUP($A80,Micronutrients,6,FALSE)*$E$14+VLOOKUP($A81,Micronutrients,6,FALSE)*AC81+VLOOKUP($A82,Micronutrients,6,FALSE)*$E$16+VLOOKUP($A83,Micronutrients,6,FALSE)*$E$17","v":0}]
["None",0,0,1,0,0,0,null,null,null,null,null,"None",0,0,1,0,0,0,null,null,null,null,null,"None",0,0,1,0,0,0]
["None",0,0,1,0,0,0,null,"Z","B","Mn",null,"None",0,0,1,0,0,0,null,"Z","B","Mn",null,"None",0,0,1,0,0,0,null,"Z","B","Mn"]
[null,null,null,null,null,null,null,null,{"$f":"VLOOKUP(A72,Macronutrients,8,FALSE)*E72+VLOOKUP(A73,Macronutrients,8,FALSE)*E73+VLOOKUP(A74,Macronutrients,8,FALSE)*E74+VLOOKUP(A75,Macronutrients,8,FALSE)*E75+VLOOKUP(A76,Macronutrients,8,FALSE)*E76+VLOOKUP(A77,Macronutrients,8,FALSE)*E77+VLOOKUP(A80,Micronutrients,8,FALSE)*E80+VLOOKUP(A81,Micronutrients,8,FALSE)*E81+VLOOKUP(A82,Micronutrients,8,FALSE)*E82+VLOOKUP(A83,Micronutrients,8,FALSE)*E83","v":0},{"$f":"VLOOKUP(A72,Macronutrients,9,FALSE)*E72+VLOOKUP(A73,Macronutrients,9,FALSE)*E73+VLOOKUP(A74,Macronutrients,9,FALSE)*E74+VLOOKUP(A75,Macronutrients,9,FALSE)*E75+VLOOKUP(A76,Macronutrients,9,FALSE)*E76+VLOOKUP(A77,Macronutrients,9,FALSE)*E77+VLOOKUP(A80,Micronutrients,9,FALSE)*E80+VLOOKUP(A81,Micronutrients,9,FALSE)*E81+VLOOKUP(A82,Micronutrients,9,FALSE)*E82+VLOOKUP(A83,Micronutrients,9,FALSE)*E83","v":0},{"$f":"VLOOKUP(A72,Macronutrients,10,FALSE)*E72+VLOOKUP(A73,Macronutrients,10,FALSE)*E73+VLOOKUP(A74,Macronutrients,10,FALSE)*E74+VLOOKUP(A75,Macronutrients,10,FALSE)*E75+VLOOKUP(A76,Macronutrients,10,FALSE)*E76+VLOOKUP(A77,Macronutrients,10,FALSE)*E77+VLOOKUP(A80,Micronutrients,10,FALSE)*E80+VLOOKUP(A81,Micronutrients,10,FALSE)*E81+VLOOKUP(A82,Micronutrients,10,FALSE)*E82+VLOOKUP(A83,Micronutrients,10,FALSE)*E83","v":0},null,null,null,null,null,null,null,null,null,{"$f":"VLOOKUP(M72,Macronutrients,8,FALSE)*Q72+VLOOKUP(M73,Macronutrients,8,FALSE)*Q73+VLOOKUP(M74,Macronutrients,8,FALSE)*Q74+VLOOKUP(M75,Macronutrients,8,FALSE)*Q75+VLOOKUP(M76,Macronutrients,8,FALSE)*Q76+VLOOKUP(M77,Macronutrients,8,FALSE)*Q77+VLOOKUP(M80,Micronutrients,8,FALSE)*Q80+VLOOKUP(M81,Micronutrients,8,FALSE)*Q81+VLOOKUP(M82,Micronutrients,8,FALSE)*Q82+VLOOKUP(M83,Micronutrients,8,FALSE)*Q83","v":0},{"$f":"VLOOKUP(M72,Macronutrients,9,FALSE)*Q72+VLOOKUP(M73,Macronutrients,9,FALSE)*Q73+VLOOKUP(M74,Macronutrients,9,FALSE)*Q74+VLOOKUP(M75,Macronutrients,9,FALSE)*Q75+VLOOKUP(M76,Macronutrients,9,FALSE)*Q76+VLOOKUP(M77,Macronutrients,9,FALSE)*Q77+VLOOKUP(M80,Micronutrients,9,FALSE)*Q80+VLOOKUP(M81,Micronutrients,9,FALSE)*Q81+VLOOKUP(M82,Micronutrients,9,FALSE)*Q82+VLOOKUP(M83,Micronutrients,9,FALSE)*Q83","v":0},{"$f":"VLOOKUP(M72,Macronutrients,10,FALSE)*Q72+VLOOKUP(M73,Macronutrients,10,FALSE)*Q73+VLOOKUP(M74,Macronutrients,10,FALSE)*Q74+VLOOKUP(M75,Macronutrients,10,FALSE)*Q75+VLOOKUP(M76,Macronutrients,10,FALSE)*Q76+VLOOKUP(M77,Macronutrients,10,FALSE)*Q77+VLOOKUP(M80,Micronutrients,10,FALSE)*Q80+VLOOKUP(M81,Micronutrients,10,FALSE)*Q81+VLOOKUP(M82,Micronutrients,10,FALSE)*Q82+VLOOKUP(M83,Micronutrients,10,FALSE)*Q83","v":0},null,null,null,null,null,null,null,null,null,{"$f":"VLOOKUP(Y72,Macronutrients,8,FALSE)*AC72+VLOOKUP(Y73,Macronutrients,8,FALSE)*AC73+VLOOKUP(Y74,Macronutrients,8,FALSE)*AC74+VLOOKUP(Y75,Macronutrients,8,FALSE)*AC75+VLOOKUP(Y76,Macronutrients,8,FALSE)*AC76+VLOOKUP(Y77,Macronutrients,8,FALSE)*AC77+VLOOKUP(Y80,Micronutrients,8,FALSE)*AC80+VLOOKUP(Y81,Micronutrients,8,FALSE)*AC81+VLOOKUP(Y82,Micronutrients,8,FALSE)*AC82+VLOOKUP(Y83,Micronutrients,8,FALSE)*AC83","v":0},{"$f":"VLOOKUP(Y72,Macronutrients,9,FALSE)*AC72+VLOOKUP(Y73,Macronutrients,9,FALSE)*AC73+VLOOKUP(Y74,Macronutrients,9,FALSE)*AC74+VLOOKUP(Y75,Macronutrients,9,FALSE)*AC75+VLOOKUP(Y76,Macronutrients,9,FALSE)*AC76+VLOOKUP(Y77,Macronutrients,9,FALSE)*AC77+VLOOKUP(Y80,Micronutrients,9,FALSE)*AC80+VLOOKUP(Y81,Micronutrients,9,FALSE)*AC81+VLOOKUP(Y82,Micronutrients,9,FALSE)*AC82+VLOOKUP(Y83,Micronutrients,9,FALSE)*AC83","v":0},{"$f":"VLOOKUP(Y72,Macronutrients,10,FALSE)*AC72+VLOOKUP(Y73,Macronutrients,10,FALSE)*AC73+VLOOKUP(Y74,Macronutrients,10,FALSE)*AC74+VLOOKUP(Y75,Macronutrients,10,FALSE)*AC75+VLOOKUP(Y76,Macronutrients,10,FALSE)*AC76+VLOOKUP(Y77,Macronutrients,10,FALSE)*AC77+VLOOKUP(Y80,Micronutrients,10,FALSE)*AC80+VLOOKUP(Y81,Micronutrients,10,FALSE)*AC81+VLOOKUP(Y82,Micronutrients,10,FALSE)*AC82+VLOOKUP(Y83,Micronutrients,10,FALSE)*AC83","v":0}]
["Micronutrients (drop down menu)",null,null,null,null,null,null,null,null,null,null,null,"Micronutrients (drop down menu)",null,null,null,null,null,null,null,null,null,null,null,"Micronutrients (drop down menu)"]
["None",{"$f":"VLOOKUP($A80,Micronutrients,14,FALSE)","v":0},{"$f":"VLOOKUP(A80,Micronutrients,18,FALSE)","v":0},{"$f":"VLOOKUP(A80,Micronutrients,16,FALSE)","v":1},0,{"$f":"VLOOKUP(A80,Micronutrients,15,FALSE)","v":0},{"$f":"(E80*VLOOKUP(A80,Micronutrients,14,FALSE)/D80)*C80","v":0},null,"Cu","Mo","Fe",null,"None",{"$f":"VLOOKUP($M80,Micronutrients,14,FALSE)","v":0},{"$f":"VLOOKUP(M80,Micronutrients,18,FALSE)","v":0},{"$f":"VLOOKUP(M80,Micronutrients,16,FALSE)","v":1},0,{"$f":"VLOOKUP(M80,Micronutrients,15,FALSE)","v":0},{"$f":"(Q80*VLOOKUP(M80,Micronutrients,14,FALSE)/P80)*O80","v":0},null,"Cu","Mo","Fe",null,"None",{"$f":"VLOOKUP(Y80,Micronutrients,14,FALSE)","v":0},{"$f":"VLOOKUP(Y80,Micronutrients,18,FALSE)","v":0},{"$f":"VLOOKUP(Y80,Micronutrients,16,FALSE)","v":1},0,{"$f":"VLOOKUP(Y80,Micronutrients,15,FALSE)","v":0},{"$f":"(AC80*VLOOKUP(Y80,Micronutrients,14,FALSE)/AB80)*AA80","v":0},null,"Cu","Mo","Fe"]
["None",{"$f":"VLOOKUP($A81,Micronutrients,14,FALSE)","v":0},{"$f":"VLOOKUP(A81,Micronutrients,18,FALSE)","v":0},{"$f":"VLOOKUP(A81,Micronutrients,16,FALSE)","v":1},0,{"$f":"VLOOKUP(A81,Micronutrients,15,FALSE)","v":0},{"$f":"(E81*VLOOKUP(A81,Micronutrients,14,FALSE)/D81)*C81","v":0},null,{"$f":"VLOOKUP(A72,Macronutrients,11,FALSE)*E72+VLOOKUP(A73,Macronutrients,11,FALSE)*E73+VLOOKUP(A74,Macronutrients,11,FALSE)*E74+VLOOKUP(A75,Macronutrients,11,FALSE)*E75+VLOOKUP(A76,Macronutrients,11,FALSE)*E76+VLOOKUP(A77,Macronutrients,11,FALSE)*E77+VLOOKUP(A80,Micronutrients,11,FALSE)*E80+VLOOKUP(A81,Micronutrients,11,FALSE)*E81+VLOOKUP(A82,Micronutrients,11,FALSE)*E82+VLOOKUP(A83,Micronutrients,11,FALSE)*E83","v":0},{"$f":"VLOOKUP(A72,Macronutrients,12,FALSE)*E72+VLOOKUP(A73,Macronutrients,12,FALSE)*E73+VLOOKUP(A74,Macronutrients,12,FALSE)*E74+VLOOKUP(A75,Macronutrients,12,FALSE)*E75+VLOOKUP(A76,Macronutrients,12,FALSE)*E76+VLOOKUP(A77,Macronutrients,12,FALSE)*E77+VLOOKUP(A80,Micronutrients,12,FALSE)*E80+VLOOKUP(A81,Micronutrients,12,FALSE)*E81+VLOOKUP(A82,Micronutrients,12,FALSE)*E82+VLOOKUP(A83,Micronutrients,12,FALSE)*E83","v":0},{"$f":"VLOOKUP(A72,Macronutrients,13,FALSE)*E72+VLOOKUP(A73,Macronutrients,13,FALSE)*E73+VLOOKUP(A74,Macronutrients,13,FALSE)*E74+VLOOKUP(A75,Macronutrients,13,FALSE)*E75+VLOOKUP(A76,Macronutrients,13,FALSE)*E76+VLOOKUP(A77,Macronutrients,13,FALSE)*E77+VLOOKUP(A80,Micronutrients,13,FALSE)*E80+VLOOKUP(A81,Micronutrients,13,FALSE)*E81+VLOOKUP(A82,Micronutrients,13,FALSE)*E82+VLOOKUP(A83,Micronutrients,13,FALSE)*E83","v":0},null,"None",{"$f":"VLOOKUP($M81,Micronutrients,14,FALSE)","v":0},{"$f":"VLOOKUP(M81,Micronutrients,18,FALSE)","v":0},{"$f":"VLOOKUP(M81,Micronutrients,16,FALSE)","v":1},0,{"$f":"VLOOKUP(M81,Micronutrients,15,FALSE)","v":0},{"$f":"(Q81*VLOOKUP(M81,Micronutrients,14,FALSE)/P81)*O81","v":0},null,{"$f":"VLOOKUP(M72,Macronutrients,11,FALSE)*Q72+VLOOKUP(M73,Macronutrients,11,FALSE)*Q73+VLOOKUP(M74,Macronutrients,11,FALSE)*Q74+VLOOKUP(M75,Macronutrients,11,FALSE)*Q75+VLOOKUP(M76,Macronutrients,11,FALSE)*Q76+VLOOKUP(M77,Macronutrients,11,FALSE)*Q77+VLOOKUP(M80,Micronutrients,11,FALSE)*Q80+VLOOKUP(M81,Micronutrients,11,FALSE)*Q81+VLOOKUP(M82,Micronutrients,11,FALSE)*Q82+VLOOKUP(M83,Micronutrients,11,FALSE)*Q83","v":0},{"$f":"VLOOKUP(M72,Macronutrients,12,FALSE)*Q72+VLOOKUP(M73,Macronutrients,12,FALSE)*Q73+VLOOKUP(M74,Macronutrients,12,FALSE)*Q74+VLOOKUP(M75,Macronutrients,12,FALSE)*Q75+VLOOKUP(M76,Macronutrients,12,FALSE)*Q76+VLOOKUP(M77,Macronutrients,12,FALSE)*Q77+VLOOKUP(M80,Micronutrients,12,FALSE)*Q80+VLOOKUP(M81,Micronutrients,12,FALSE)*Q81+VLOOKUP(M82,Micronutrients,12,FALSE)*Q82+VLOOKUP(M83,Micronutrients,12,FALSE)*Q83","v":0},{"$f":"VLOOKUP(M72,Macronutrients,13,FALSE)*Q72+VLOOKUP(M73,Macronutrients,13,FALSE)*Q73+VLOOKUP(M74,Macronutrients,13,FALSE)*Q74+VLOOKUP(M75,Macronutrients,13,FALSE)*Q75+VLOOKUP(M76,Macronutrients,13,FALSE)*Q76+VLOOKUP(M77,Macronutrients,13,FALSE)*Q77+VLOOKUP(M80,Micronutrients,13,FALSE)*Q80+VLOOKUP(M81,Micronutrients,13,FALSE)*Q81+VLOOKUP(M82,Micronutrients,13,FALSE)*Q82+VLOOKUP(M83,Micronutrients,13,FALSE)*Q83","v":0},null,"None",{"$f":"VLOOKUP(Y81,Micronutrients,14,FALSE)","v":0},{"$f":"VLOOKUP(Y81,Micronutrients,18,FALSE)","v":0},{"$f":"VLOOKUP(Y81,Micronutrients,16,FALSE)","v":1},0,{"$f":"VLOOKUP(Y81,Micronutrients,15,FALSE)","v":0},{"$f":"(AC81*VLOOKUP(Y81,Micronutrients,14,FALSE)/AB81)*AA81","v":0},null,{"$f":"VLOOKUP(Y72,Macronutrients,11,FALSE)*AC72+VLOOKUP(Y73,Macronutrients,11,FALSE)*AC73+VLOOKUP(Y74,Macronutrients,11,FALSE)*AC74+VLOOKUP(Y75,Macronutrients,11,FALSE)*AC75+VLOOKUP(Y76,Macronutrients,11,FALSE)*AC76+VLOOKUP(Y77,Macronutrients,11,FALSE)*AC77+VLOOKUP(Y80,Micronutrients,11,FALSE)*AC80+VLOOKUP(Y81,Micronutrients,11,FALSE)*AC81+VLOOKUP(Y82,Micronutrients,11,FALSE)*AC82+VLOOKUP(Y83,Micronutrients,11,FALSE)*AC83","v":0},{"$f":"VLOOKUP(Y72,Macronutrients,12,FALSE)*AC72+VLOOKUP(Y73,Macronutrients,12,FALSE)*AC73+VLOOKUP(Y74,Macronutrients,12,FALSE)*AC74+VLOOKUP(Y75,Macronutrients,12,FALSE)*AC75+VLOOKUP(Y76,Macronutrients,12,FALSE)*AC76+VLOOKUP(Y77,Macronutrients,12,FALSE)*AC77+VLOOKUP(Y80,Micronutrients,12,FALSE)*AC80+VLOOKUP(Y81,Micronutrients,12,FALSE)*AC81+VLOOKUP(Y82,Micronutrients,12,FALSE)*AC82+VLOOKUP(Y83,Micronutrients,12,FALSE)*AC83","v":0},{"$f":"VLOOKUP(Y72,Macronutrients,13,FALSE)*AC72+VLOOKUP(Y73,Macronutrients,13,FALSE)*AC73+VLOOKUP(Y74,Macronutrients,13,FALSE)*AC74+VLOOKUP(Y75,Macronutrients,13,FALSE)*AC75+VLOOKUP(Y76,Macronutrients,13,FALSE)*AC76+VLOOKUP(Y77,Macronutrients,13,FALSE)*AC77+VLOOKUP(Y80,Micronutrients,13,FALSE)*AC80+VLOOKUP(Y81,Micronutrients,13,FALSE)*AC81+VLOOKUP(Y82,Micronutrients,13,FALSE)*AC82+VLOOKUP(Y83,Micronutrients,13,FALSE)*AC83","v":0}]
["None",{"$f":"VLOOKUP($A82,Micronutrients,14,FALSE)","v":0},{"$f":"VLOOKUP(A82,Micronutrients,18,FALSE)","v":0},{"$f":"VLOOKUP(A82,Micronutrients,16,FALSE)","v":1},0,{"$f":"VLOOKUP(A82,Micronutrients,15,FALSE)","v":0},{"$f":"(E82*VLOOKUP(A82,Micronutrients,14,FALSE)/D82)*C82","v":0},null,null,null,null,null,"None",{"$f":"VLOOKUP($M82,Micronutrients,14,FALSE)","v":0},{"$f":"VLOOKUP(M82,Micronutrients,18,FALSE)","v":0},{"$f":"VLOOKUP(M82,Micronutrients,16,FALSE)","v":1},0,{"$f":"VLOOKUP(M82,Micronutrients,15,FALSE)","v":0},{"$f":"(Q82*VLOOKUP(M82,Micronutrients,14,FALSE)/P82)*O82","v":0},null,null,null,null,null,"None",{"$f":"VLOOKUP(Y82,Micronutrients,14,FALSE)","v":0},{"$f":"VLOOKUP(Y82,Micronutrients,18,FALSE)","v":0},{"$f":"VLOOKUP(Y82,Micronutrients,16,FALSE)","v":1},0,{"$f":"VLOOKUP(Y82,Micronutrients,15,FALSE)","v":0},{"$f":"(AC82*VLOOKUP(Y82,Micronutrients,14,FALSE)/AB82)*AA82","v":0}]
["None",{"$f":"VLOOKUP($A83,Micronutrients,14,FALSE)","v":0},{"$f":"VLOOKUP(A83,Micronutrients,18,FALSE)","v":0},{"$f":"VLOOKUP(A83,Micronutrients,16,FALSE)","v":1},0,{"$f":"VLOOKUP(A83,Micronutrients,15,FALSE)","v":0},{"$f":"(E83*VLOOKUP(A83,Micronutrients,14,FALSE)/D83)*C83","v":0},null,null,null,null,null,"None",{"$f":"VLOOKUP($M83,Micronutrients,14,FALSE)","v":0},{"$f":"VLOOKUP(M83,Micronutrients,18,FALSE)","v":0},{"$f":"VLOOKUP(M83,Micronutrients,16,FALSE)","v":1},0,{"$f":"VLOOKUP(M83,Micronutrients,15,FALSE)","v":0},{"$f":"(Q83*VLOOKUP(M83,Micronutrients,14,FALSE)/P83)*O83","v":0},null,null,null,null,null,"None",{"$f":"VLOOKUP(Y83,Micronutrients,14,FALSE)","v":0},{"$f":"VLOOKUP(Y83,Micronutrients,18,FALSE)","v":0},{"$f":"VLOOKUP(Y83,Micronutrients,16,FALSE)","v":1},0,{"$f":"VLOOKUP(Y83,Micronutrients,15,FALSE)","v":0},{"$f":"(AC83*VLOOKUP(Y83,Micronutrients,14,FALSE)/AB83)*AA83","v":0}]
[]
["Nitrogen Stabilizers (drop down menu)",null,null,null,null,null,null,null,null,null,null,null,"Nitrogen Stabilizers (drop down menu)",null,null,null,null,null,null,null,null,null,null,null,"Nitrogen Stabilizers (drop down menu)"]
["None",{"$f":"VLOOKUP(A86,NitrogenStabilizers,14,FALSE)","v":0},{"$f":"VLOOKUP(A86,NitrogenStabilizers,18,FALSE)","v":0},{"$f":"VLOOKUP(A86,NitrogenStabilizers,16,FALSE)","v":1},0,{"$f":"VLOOKUP(A86,NitrogenStabilizers,15,FALSE)","v":0},{"$f":"(E86*VLOOKUP(A86,NitrogenStabilizers,14,FALSE)/D86)*C86","v":0},null,null,null,null,null,"None",{"$f":"VLOOKUP(M86,NitrogenStabilizers,14,FALSE)","v":0},{"$f":"VLOOKUP(M86,NitrogenStabilizers,18,FALSE)","v":0},{"$f":"VLOOKUP(M86,NitrogenStabilizers,16,FALSE)","v":1},0,{"$f":"VLOOKUP(M86,NitrogenStabilizers,15,FALSE)","v":0},{"$f":"(Q86*VLOOKUP(M86,NitrogenStabilizers,14,FALSE)/P86)*O86","v":0},null,null,null,null,null,"None",{"$f":"VLOOKUP(Y86,NitrogenStabilizers,14,FALSE)","v":0},{"$f":"VLOOKUP(Y86,NitrogenStabilizers,18,FALSE)","v":0},{"$f":"VLOOKUP(Y86,NitrogenStabilizers,16,FALSE)","v":1},0,{"$f":"VLOOKUP(Y86,NitrogenStabilizers,15,FALSE)","v":0},{"$f":"(AC86*VLOOKUP(Y86,NitrogenStabilizers,14,FALSE)/AB86)*AA86","v":0}]
["None",{"$f":"VLOOKUP(A87,NitrogenStabilizers,14,FALSE)","v":0},{"$f":"VLOOKUP(A87,NitrogenStabilizers,18,FALSE)","v":0},{"$f":"VLOOKUP(A87,NitrogenStabilizers,16,FALSE)","v":1},0,{"$f":"VLOOKUP(A87,NitrogenStabilizers,15,FALSE)","v":0},{"$f":"(E87*VLOOKUP(A87,NitrogenStabilizers,14,FALSE)/D87)*C87","v":0},null,null,null,"More",null,"None",{"$f":"VLOOKUP(M87,NitrogenStabilizers,14,FALSE)","v":0},{"$f":"VLOOKUP(M87,NitrogenStabilizers,18,FALSE)","v":0},{"$f":"VLOOKUP(M87,NitrogenStabilizers,16,FALSE)","v":1},0,{"$f":"VLOOKUP(M87,NitrogenStabilizers,15,FALSE)","v":0},{"$f":"(Q87*VLOOKUP(M87,NitrogenStabilizers,14,FALSE)/P87)*O87","v":0},null,null,null,"More",null,"None",{"$f":"VLOOKUP(Y87,NitrogenStabilizers,14,FALSE)","v":0},{"$f":"VLOOKUP(Y87,NitrogenStabilizers,18,FALSE)","v":0},{"$f":"VLOOKUP(Y87,NitrogenStabilizers,16,FALSE)","v":1},0,{"$f":"VLOOKUP(Y87,NitrogenStabilizers,15,FALSE)","v":0},{"$f":"(AC87*VLOOKUP(Y87,NitrogenStabilizers,14,FALSE)/AB87)*AA87","v":0},null,null,null,"More"]
["4th Application Fertilizer Cost/Acre",null,null,null,null,null,{"$f":"SUM(G72:G87)","v":0},null,null,null,"Below",null,"4th Application Fertilizer Cost/Acre",null,null,null,null,null,{"$f":"SUM(S72:S87)","v":0},null,null,null,"Below",null,"4th Application Fertilizer Cost/Acre",null,null,null,null,null,{"$f":"SUM(AE72:AE87)","v":0},null,null,null,"Below"]
[null,null,null,null,null,null,null,null,null,null,"¯",null,null,null,null,null,null,null,null,null,null,null,"¯",null,null,null,null,null,null,null,null,null,null,null,"¯"]
["5th Application (i.e., Side-Dress or Broadcast or Fertigation)",null,null,null,null,null,null,null,null,null,null,null,"5th Application (i.e., Side-Dress or Broadcast or Fertigation)",null,null,null,null,null,null,null,null,null,null,null,"5th Application (i.e., Side-Dress or Broadcast or Fertigation)"]
["Fertilizer Source","Purchase Units","Package Price (Gals, Lbs, etc.)","Units/Pkg","Rate/Acre","Units","Cost",null,null,null,null,null,"Fertilizer Source","Purchase Units","Package Price (Gals, Lbs, etc.)","Units/Pkg","Rate/Acre","Units","Cost",null,null,null,null,null,"Fertilizer Source","Purchase Units","Package Price (Gals, Lbs, etc.)","Units/Pkg","Rate/Acre","Units","Cost"]
["Macronutrients (drop down menu)",null,null,null,"(Enter Below)",null,null,null,"N","P","K",null,"Macronutrients (drop down menu)",null,null,null,"(Enter Below)",null,null,null,"N","P","K",null,"Macronutrients (drop down menu)",null,null,null,"(Enter Below)",null,null,null,"N","P","K"]
["None",{"$f":"VLOOKUP(A93,Macronutrients,14,FALSE)","v":0},{"$f":"VLOOKUP(A93,Macronutrients,18,FALSE)","v":0},{"$f":"VLOOKUP(A93,Macronutrients,16,FALSE)","v":1},0,{"$f":"VLOOKUP(A93,Macronutrients,15,FALSE)","v":0},{"$f":"(E93*VLOOKUP(A93,Macronutrients,14,FALSE)/D93)*C93","v":0},null,{"$f":"VLOOKUP(A93,Macronutrients,2,FALSE)*E93+VLOOKUP(A94,Macronutrients,2,FALSE)*E94+VLOOKUP(A95,Macronutrients,2,FALSE)*E95+VLOOKUP(A96,Macronutrients,2,FALSE)*E96+VLOOKUP(A97,Macronutrients,2,FALSE)*E97+VLOOKUP(A98,Macronutrients,2,FALSE)*E98+VLOOKUP(A101,Micronutrients,2,FALSE)*E101+VLOOKUP(A102,Micronutrients,2,FALSE)*E102+VLOOKUP(A103,Micronutrients,2,FALSE)*E103+VLOOKUP(A104,Micronutrients,2,FALSE)*E104","v":0},{"$f":"VLOOKUP(A93,Macronutrients,3,FALSE)*E93+VLOOKUP(A94,Macronutrients,3,FALSE)*E94+VLOOKUP(A95,Macronutrients,3,FALSE)*E95+VLOOKUP(A96,Macronutrients,3,FALSE)*E96+VLOOKUP(A97,Macronutrients,3,FALSE)*E97+VLOOKUP(A98,Macronutrients,3,FALSE)*E98+VLOOKUP(A101,Micronutrients,3,FALSE)*E101+VLOOKUP(A102,Micronutrients,3,FALSE)*E102+VLOOKUP(A103,Micronutrients,3,FALSE)*E103+VLOOKUP(A104,Micronutrients,3,FALSE)*E104","v":0},{"$f":"VLOOKUP(A93,Macronutrients,4,FALSE)*E93+VLOOKUP(A94,Macronutrients,4,FALSE)*E94+VLOOKUP(A95,Macronutrients,4,FALSE)*E95+VLOOKUP(A96,Macronutrients,4,FALSE)*E96+VLOOKUP(A97,Macronutrients,4,FALSE)*E97+VLOOKUP(A98,Macronutrients,4,FALSE)*E98+VLOOKUP(A101,Micronutrients,4,FALSE)*E101+VLOOKUP(A102,Micronutrients,4,FALSE)*E102+VLOOKUP(A103,Micronutrients,4,FALSE)*E103+VLOOKUP(A104,Micronutrients,4,FALSE)*E104","v":0},null,"None",{"$f":"VLOOKUP(M93,Macronutrients,14,FALSE)","v":0},{"$f":"VLOOKUP(M93,Macronutrients,18,FALSE)","v":0},{"$f":"VLOOKUP(M93,Macronutrients,16,FALSE)","v":1},0,{"$f":"VLOOKUP(M93,Macronutrients,15,FALSE)","v":0},{"$f":"(Q93*VLOOKUP(M93,Macronutrients,14,FALSE)/P93)*O93","v":0},null,{"$f":"VLOOKUP(M93,Macronutrients,2,FALSE)*Q93+VLOOKUP(M94,Macronutrients,2,FALSE)*Q94+VLOOKUP(M95,Macronutrients,2,FALSE)*Q95+VLOOKUP(M96,Macronutrients,2,FALSE)*Q96+VLOOKUP(M97,Macronutrients,2,FALSE)*Q97+VLOOKUP(M98,Macronutrients,2,FALSE)*Q98+VLOOKUP(M101,Micronutrients,2,FALSE)*Q101+VLOOKUP(M102,Micronutrients,2,FALSE)*Q102+VLOOKUP(M103,Micronutrients,2,FALSE)*Q103+VLOOKUP(M104,Micronutrients,2,FALSE)*Q104","v":0},{"$f":"VLOOKUP(M93,Macronutrients,3,FALSE)*Q93+VLOOKUP(M94,Macronutrients,3,FALSE)*Q94+VLOOKUP(M95,Macronutrients,3,FALSE)*Q95+VLOOKUP(M96,Macronutrients,3,FALSE)*Q96+VLOOKUP(M97,Macronutrients,3,FALSE)*Q97+VLOOKUP(M98,Macronutrients,3,FALSE)*Q98+VLOOKUP(M101,Micronutrients,3,FALSE)*Q101+VLOOKUP(M102,Micronutrients,3,FALSE)*Q102+VLOOKUP(M103,Micronutrients,3,FALSE)*Q103+VLOOKUP(M104,Micronutrients,3,FALSE)*Q104","v":0},{"$f":"VLOOKUP(M93,Macronutrients,4,FALSE)*Q93+VLOOKUP(M94,Macronutrients,4,FALSE)*Q94+VLOOKUP(M95,Macronutrients,4,FALSE)*Q95+VLOOKUP(M96,Macronutrients,4,FALSE)*Q96+VLOOKUP(M97,Macronutrients,4,FALSE)*Q97+VLOOKUP(M98,Macronutrients,4,FALSE)*Q98+VLOOKUP(M101,Micronutrients,4,FALSE)*Q101+VLOOKUP(M102,Micronutrients,4,FALSE)*Q102+VLOOKUP(M103,Micronutrients,4,FALSE)*Q103+VLOOKUP(M104,Micronutrients,4,FALSE)*Q104","v":0},null,"None",{"$f":"VLOOKUP(Y93,Macronutrients,14,FALSE)","v":0},{"$f":"VLOOKUP(Y93,Macronutrients,18,FALSE)","v":0},{"$f":"VLOOKUP(Y93,Macronutrients,16,FALSE)","v":1},0,{"$f":"VLOOKUP(Y93,Macronutrients,15,FALSE)","v":0},{"$f":"(AC93*VLOOKUP(Y93,Macronutrients,14,FALSE)/AB93)*AA93","v":0},null,{"$f":"VLOOKUP(Y93,Macronutrients,2,FALSE)*AC93+VLOOKUP(Y94,Macronutrients,2,FALSE)*AC94+VLOOKUP(Y95,Macronutrients,2,FALSE)*AC95+VLOOKUP(Y96,Macronutrients,2,FALSE)*AC96+VLOOKUP(Y97,Macronutrients,2,FALSE)*AC97+VLOOKUP(Y98,Macronutrients,2,FALSE)*AC98+VLOOKUP(Y101,Micronutrients,2,FALSE)*AC101+VLOOKUP(Y102,Micronutrients,2,FALSE)*AC102+VLOOKUP(Y103,Micronutrients,2,FALSE)*AC103+VLOOKUP(Y104,Micronutrients,2,FALSE)*AC104","v":0},{"$f":"VLOOKUP(Y93,Macronutrients,3,FALSE)*AC93+VLOOKUP(Y94,Macronutrients,3,FALSE)*AC94+VLOOKUP(Y95,Macronutrients,3,FALSE)*AC95+VLOOKUP(Y96,Macronutrients,3,FALSE)*AC96+VLOOKUP(Y97,Macronutrients,3,FALSE)*AC97+VLOOKUP(Y98,Macronutrients,3,FALSE)*AC98+VLOOKUP(Y101,Micronutrients,3,FALSE)*AC101+VLOOKUP(Y102,Micronutrients,3,FALSE)*AC102+VLOOKUP(Y103,Micronutrients,3,FALSE)*AC103+VLOOKUP(Y104,Micronutrients,3,FALSE)*AC104","v":0},{"$f":"VLOOKUP(Y93,Macronutrients,4,FALSE)*AC93+VLOOKUP(Y94,Macronutrients,4,FALSE)*AC94+VLOOKUP(Y95,Macronutrients,4,FALSE)*AC95+VLOOKUP(Y96,Macronutrients,4,FALSE)*AC96+VLOOKUP(Y97,Macronutrients,4,FALSE)*AC97+VLOOKUP(Y98,Macronutrients,4,FALSE)*AC98+VLOOKUP(Y101,Micronutrients,4,FALSE)*AC101+VLOOKUP(Y102,Micronutrients,4,FALSE)*AC102+VLOOKUP(Y103,Micronutrients,4,FALSE)*AC103+VLOOKUP(Y104,Micronutrients,4,FALSE)*AC104","v":0}]
["None",0,0,1,0,0,0,null,null,null,null,null,"None",0,0,1,0,0,0,null,null,null,null,null,"None",0,0,1,0,0,0]
["None",0,0,1,0,0,0,null,"S","Ca","Mg",null,"None",0,0,1,0,0,0,null,"S","Ca","Mg",null,"None",0,0,1,0,0,0,null,"S","Ca","Mg"]
["None",0,0,1,0,0,0,null,{"$f":"VLOOKUP(A93,Macronutrients,5,FALSE)*E93+VLOOKUP(A94,Macronutrients,5,FALSE)*E94+VLOOKUP(A95,Macronutrients,5,FALSE)*E95+VLOOKUP(A96,Macronutrients,5,FALSE)*E96+VLOOKUP(A97,Macronutrients,5,FALSE)*E97+VLOOKUP(A98,Macronutrients,5,FALSE)*E98+VLOOKUP(A101,Micronutrients,5,FALSE)*E101+VLOOKUP(A102,Micronutrients,5,FALSE)*E102+VLOOKUP(A103,Micronutrients,5,FALSE)*E103+VLOOKUP(A104,Micronutrients,5,FALSE)*E104","v":0},{"$f":"VLOOKUP(A93,Macronutrients,7,FALSE)*E93+VLOOKUP(A94,Macronutrients,7,FALSE)*E94+VLOOKUP(A95,Macronutrients,7,FALSE)*E95+VLOOKUP(A96,Macronutrients,7,FALSE)*E96+VLOOKUP(A97,Macronutrients,7,FALSE)*E97+VLOOKUP(A98,Macronutrients,7,FALSE)*E98+VLOOKUP(A101,Micronutrients,7,FALSE)*E101+VLOOKUP(A102,Micronutrients,7,FALSE)*E102+VLOOKUP(A103,Micronutrients,7,FALSE)*E103+VLOOKUP(A104,Micronutrients,7,FALSE)*E104","v":0},{"$f":"VLOOKUP($A93,Macronutrients,6,FALSE)*$E$6+VLOOKUP($A94,Macronutrients,6,FALSE)*$E$7+VLOOKUP($A95,Macronutrients,6,FALSE)*$E$8+VLOOKUP($A96,Macronutrients,6,FALSE)*$E$9+VLOOKUP($A97,Macronutrients,6,FALSE)*$E$10+VLOOKUP($A98,Macronutrients,6,FALSE)*$E$11+VLOOKUP($A101,Micronutrients,6,FALSE)*$E$14+VLOOKUP($A102,Micronutrients,6,FALSE)*E102+VLOOKUP($A103,Micronutrients,6,FALSE)*$E$16+VLOOKUP($A104,Micronutrients,6,FALSE)*$E$17","v":0},null,"None",0,0,1,0,0,0,null,{"$f":"VLOOKUP(M93,Macronutrients,5,FALSE)*Q93+VLOOKUP(M94,Macronutrients,5,FALSE)*Q94+VLOOKUP(M95,Macronutrients,5,FALSE)*Q95+VLOOKUP(M96,Macronutrients,5,FALSE)*Q96+VLOOKUP(M97,Macronutrients,5,FALSE)*Q97+VLOOKUP(M98,Macronutrients,5,FALSE)*Q98+VLOOKUP(M101,Micronutrients,5,FALSE)*Q101+VLOOKUP(M102,Micronutrients,5,FALSE)*Q102+VLOOKUP(M103,Micronutrients,5,FALSE)*Q103+VLOOKUP(M104,Micronutrients,5,FALSE)*Q104","v":0},{"$f":"VLOOKUP(M93,Macronutrients,7,FALSE)*Q93+VLOOKUP(M94,Macronutrients,7,FALSE)*Q94+VLOOKUP(M95,Macronutrients,7,FALSE)*Q95+VLOOKUP(M96,Macronutrients,7,FALSE)*Q96+VLOOKUP(M97,Macronutrients,7,FALSE)*Q97+VLOOKUP(M98,Macronutrients,7,FALSE)*Q98+VLOOKUP(M101,Micronutrients,7,FALSE)*Q101+VLOOKUP(M102,Micronutrients,7,FALSE)*Q102+VLOOKUP(M103,Micronutrients,7,FALSE)*Q103+VLOOKUP(M104,Micronutrients,7,FALSE)*Q104","v":0},{"$f":"VLOOKUP($A93,Macronutrients,6,FALSE)*$E$6+VLOOKUP($A94,Macronutrients,6,FALSE)*$E$7+VLOOKUP($A95,Macronutrients,6,FALSE)*$E$8+VLOOKUP($A96,Macronutrients,6,FALSE)*$E$9+VLOOKUP($A97,Macronutrients,6,FALSE)*$E$10+VLOOKUP($A98,Macronutrients,6,FALSE)*$E$11+VLOOKUP($A101,Micronutrients,6,FALSE)*$E$14+VLOOKUP($A102,Micronutrients,6,FALSE)*Q102+VLOOKUP($A103,Micronutrients,6,FALSE)*$E$16+VLOOKUP($A104,Micronutrients,6,FALSE)*$E$17","v":0},null,"None",0,0,1,0,0,0,null,{"$f":"VLOOKUP(Y93,Macronutrients,5,FALSE)*AC93+VLOOKUP(Y94,Macronutrients,5,FALSE)*AC94+VLOOKUP(Y95,Macronutrients,5,FALSE)*AC95+VLOOKUP(Y96,Macronutrients,5,FALSE)*AC96+VLOOKUP(Y97,Macronutrients,5,FALSE)*AC97+VLOOKUP(Y98,Macronutrients,5,FALSE)*AC98+VLOOKUP(Y101,Micronutrients,5,FALSE)*AC101+VLOOKUP(Y102,Micronutrients,5,FALSE)*AC102+VLOOKUP(Y103,Micronutrients,5,FALSE)*AC103+VLOOKUP(Y104,Micronutrients,5,FALSE)*AC104","v":0},{"$f":"VLOOKUP(Y93,Macronutrients,7,FALSE)*AC93+VLOOKUP(Y94,Macronutrients,7,FALSE)*AC94+VLOOKUP(Y95,Macronutrients,7,FALSE)*AC95+VLOOKUP(Y96,Macronutrients,7,FALSE)*AC96+VLOOKUP(Y97,Macronutrients,7,FALSE)*AC97+VLOOKUP(Y98,Macronutrients,7,FALSE)*AC98+VLOOKUP(Y101,Micronutrients,7,FALSE)*AC101+VLOOKUP(Y102,Micronutrients,7,FALSE)*AC102+VLOOKUP(Y103,Micronutrients,7,FALSE)*AC103+VLOOKUP(Y104,Micronutrients,7,FALSE)*AC104","v":0},{"$f":"VLOOKUP($A93,Macronutrients,6,FALSE)*$E$6+VLOOKUP($A94,Macronutrients,6,FALSE)*$E$7+VLOOKUP($A95,Macronutrients,6,FALSE)*$E$8+VLOOKUP($A96,Macronutrients,6,FALSE)*$E$9+VLOOKUP($A97,Macronutrients,6,FALSE)*$E$10+VLOOKUP($A98,Macronutrients,6,FALSE)*$E$11+VLOOKUP($A101,Micronutrients,6,FALSE)*$E$14+VLOOKUP($A102,Micronutrients,6,FALSE)*AC102+VLOOKUP($A103,Micronutrients,6,FALSE)*$E$16+VLOOKUP($A104,Micronutrients,6,FALSE)*$E$17","v":0}]
["None",0,0,1,0,0,0,null,null,null,null,null,"None",0,0,1,0,0,0,null,null,null,null,null,"None",0,0,1,0,0,0]
["None",0,0,1,0,0,0,null,"Z","B","Mn",null,"None",0,0,1,0,0,0,null,"Z","B","Mn",null,"None",0,0,1,0,0,0,null,"Z","B","Mn"]
[null,null,null,null,null,null,null,null,{"$f":"VLOOKUP(A93,Macronutrients,8,FALSE)*E93+VLOOKUP(A94,Macronutrients,8,FALSE)*E94+VLOOKUP(A95,Macronutrients,8,FALSE)*E95+VLOOKUP(A96,Macronutrients,8,FALSE)*E96+VLOOKUP(A97,Macronutrients,8,FALSE)*E97+VLOOKUP(A98,Macronutrients,8,FALSE)*E98+VLOOKUP(A101,Micronutrients,8,FALSE)*E101+VLOOKUP(A102,Micronutrients,8,FALSE)*E102+VLOOKUP(A103,Micronutrients,8,FALSE)*E103+VLOOKUP(A104,Micronutrients,8,FALSE)*E104","v":0},{"$f":"VLOOKUP(A93,Macronutrients,9,FALSE)*E93+VLOOKUP(A94,Macronutrients,9,FALSE)*E94+VLOOKUP(A95,Macronutrients,9,FALSE)*E95+VLOOKUP(A96,Macronutrients,9,FALSE)*E96+VLOOKUP(A97,Macronutrients,9,FALSE)*E97+VLOOKUP(A98,Macronutrients,9,FALSE)*E98+VLOOKUP(A101,Micronutrients,9,FALSE)*E101+VLOOKUP(A102,Micronutrients,9,FALSE)*E102+VLOOKUP(A103,Micronutrients,9,FALSE)*E103+VLOOKUP(A104,Micronutrients,9,FALSE)*E104","v":0},{"$f":"VLOOKUP(A93,Macronutrients,10,FALSE)*E93+VLOOKUP(A94,Macronutrients,10,FALSE)*E94+VLOOKUP(A95,Macronutrients,10,FALSE)*E95+VLOOKUP(A96,Macronutrients,10,FALSE)*E96+VLOOKUP(A97,Macronutrients,10,FALSE)*E97+VLOOKUP(A98,Macronutrients,10,FALSE)*E98+VLOOKUP(A101,Micronutrients,10,FALSE)*E101+VLOOKUP(A102,Micronutrients,10,FALSE)*E102+VLOOKUP(A103,Micronutrients,10,FALSE)*E103+VLOOKUP(A104,Micronutrients,10,FALSE)*E104","v":0},null,null,null,null,null,null,null,null,null,{"$f":"VLOOKUP(M93,Macronutrients,8,FALSE)*Q93+VLOOKUP(M94,Macronutrients,8,FALSE)*Q94+VLOOKUP(M95,Macronutrients,8,FALSE)*Q95+VLOOKUP(M96,Macronutrients,8,FALSE)*Q96+VLOOKUP(M97,Macronutrients,8,FALSE)*Q97+VLOOKUP(M98,Macronutrients,8,FALSE)*Q98+VLOOKUP(M101,Micronutrients,8,FALSE)*Q101+VLOOKUP(M102,Micronutrients,8,FALSE)*Q102+VLOOKUP(M103,Micronutrients,8,FALSE)*Q103+VLOOKUP(M104,Micronutrients,8,FALSE)*Q104","v":0},{"$f":"VLOOKUP(M93,Macronutrients,9,FALSE)*Q93+VLOOKUP(M94,Macronutrients,9,FALSE)*Q94+VLOOKUP(M95,Macronutrients,9,FALSE)*Q95+VLOOKUP(M96,Macronutrients,9,FALSE)*Q96+VLOOKUP(M97,Macronutrients,9,FALSE)*Q97+VLOOKUP(M98,Macronutrients,9,FALSE)*Q98+VLOOKUP(M101,Micronutrients,9,FALSE)*Q101+VLOOKUP(M102,Micronutrients,9,FALSE)*Q102+VLOOKUP(M103,Micronutrients,9,FALSE)*Q103+VLOOKUP(M104,Micronutrients,9,FALSE)*Q104","v":0},{"$f":"VLOOKUP(M93,Macronutrients,10,FALSE)*Q93+VLOOKUP(M94,Macronutrients,10,FALSE)*Q94+VLOOKUP(M95,Macronutrients,10,FALSE)*Q95+VLOOKUP(M96,Macronutrients,10,FALSE)*Q96+VLOOKUP(M97,Macronutrients,10,FALSE)*Q97+VLOOKUP(M98,Macronutrients,10,FALSE)*Q98+VLOOKUP(M101,Micronutrients,10,FALSE)*Q101+VLOOKUP(M102,Micronutrients,10,FALSE)*Q102+VLOOKUP(M103,Micronutrients,10,FALSE)*Q103+VLOOKUP(M104,Micronutrients,10,FALSE)*Q104","v":0},null,null,null,null,null,null,null,null,null,{"$f":"VLOOKUP(Y93,Macronutrients,8,FALSE)*AC93+VLOOKUP(Y94,Macronutrients,8,FALSE)*AC94+VLOOKUP(Y95,Macronutrients,8,FALSE)*AC95+VLOOKUP(Y96,Macronutrients,8,FALSE)*AC96+VLOOKUP(Y97,Macronutrients,8,FALSE)*AC97+VLOOKUP(Y98,Macronutrients,8,FALSE)*AC98+VLOOKUP(Y101,Micronutrients,8,FALSE)*AC101+VLOOKUP(Y102,Micronutrients,8,FALSE)*AC102+VLOOKUP(Y103,Micronutrients,8,FALSE)*AC103+VLOOKUP(Y104,Micronutrients,8,FALSE)*AC104","v":0},{"$f":"VLOOKUP(Y93,Macronutrients,9,FALSE)*AC93+VLOOKUP(Y94,Macronutrients,9,FALSE)*AC94+VLOOKUP(Y95,Macronutrients,9,FALSE)*AC95+VLOOKUP(Y96,Macronutrients,9,FALSE)*AC96+VLOOKUP(Y97,Macronutrients,9,FALSE)*AC97+VLOOKUP(Y98,Macronutrients,9,FALSE)*AC98+VLOOKUP(Y101,Micronutrients,9,FALSE)*AC101+VLOOKUP(Y102,Micronutrients,9,FALSE)*AC102+VLOOKUP(Y103,Micronutrients,9,FALSE)*AC103+VLOOKUP(Y104,Micronutrients,9,FALSE)*AC104","v":0},{"$f":"VLOOKUP(Y93,Macronutrients,10,FALSE)*AC93+VLOOKUP(Y94,Macronutrients,10,FALSE)*AC94+VLOOKUP(Y95,Macronutrients,10,FALSE)*AC95+VLOOKUP(Y96,Macronutrients,10,FALSE)*AC96+VLOOKUP(Y97,Macronutrients,10,FALSE)*AC97+VLOOKUP(Y98,Macronutrients,10,FALSE)*AC98+VLOOKUP(Y101,Micronutrients,10,FALSE)*AC101+VLOOKUP(Y102,Micronutrients,10,FALSE)*AC102+VLOOKUP(Y103,Micronutrients,10,FALSE)*AC103+VLOOKUP(Y104,Micronutrients,10,FALSE)*AC104","v":0}]
["Micronutrients (drop down menu)",null,null,null,null,null,null,null,null,null,null,null,"Micronutrients (drop down menu)",null,null,null,null,null,null,null,null,null,null,null,"Micronutrients (drop down menu)"]
["None",{"$f":"VLOOKUP($A101,Micronutrients,14,FALSE)","v":0},{"$f":"VLOOKUP(A101,Micronutrients,18,FALSE)","v":0},{"$f":"VLOOKUP(A101,Micronutrients,16,FALSE)","v":1},0,{"$f":"VLOOKUP(A101,Micronutrients,15,FALSE)","v":0},{"$f":"(E101*VLOOKUP(A101,Micronutrients,14,FALSE)/D101)*C101","v":0},null,"Cu","Mo","Fe",null,"None",{"$f":"VLOOKUP($M101,Micronutrients,14,FALSE)","v":0},{"$f":"VLOOKUP(M101,Micronutrients,18,FALSE)","v":0},{"$f":"VLOOKUP(M101,Micronutrients,16,FALSE)","v":1},0,{"$f":"VLOOKUP(M101,Micronutrients,15,FALSE)","v":0},{"$f":"(Q101*VLOOKUP(M101,Micronutrients,14,FALSE)/P101)*O101","v":0},null,"Cu","Mo","Fe",null,"None",{"$f":"VLOOKUP(Y101,Micronutrients,14,FALSE)","v":0},{"$f":"VLOOKUP(Y101,Micronutrients,18,FALSE)","v":0},{"$f":"VLOOKUP(Y101,Micronutrients,16,FALSE)","v":1},0,{"$f":"VLOOKUP(Y101,Micronutrients,15,FALSE)","v":0},{"$f":"(AC101*VLOOKUP(Y101,Micronutrients,14,FALSE)/AB101)*AA101","v":0},null,"Cu","Mo","Fe"]
["None",{"$f":"VLOOKUP($A102,Micronutrients,14,FALSE)","v":0},{"$f":"VLOOKUP(A102,Micronutrients,18,FALSE)","v":0},{"$f":"VLOOKUP(A102,Micronutrients,16,FALSE)","v":1},0,{"$f":"VLOOKUP(A102,Micronutrients,15,FALSE)","v":0},{"$f":"(E102*VLOOKUP(A102,Micronutrients,14,FALSE)/D102)*C102","v":0},null,{"$f":"VLOOKUP(A93,Macronutrients,11,FALSE)*E93+VLOOKUP(A94,Macronutrients,11,FALSE)*E94+VLOOKUP(A95,Macronutrients,11,FALSE)*E95+VLOOKUP(A96,Macronutrients,11,FALSE)*E96+VLOOKUP(A97,Macronutrients,11,FALSE)*E97+VLOOKUP(A98,Macronutrients,11,FALSE)*E98+VLOOKUP(A101,Micronutrients,11,FALSE)*E101+VLOOKUP(A102,Micronutrients,11,FALSE)*E102+VLOOKUP(A103,Micronutrients,11,FALSE)*E103+VLOOKUP(A104,Micronutrients,11,FALSE)*E104","v":0},{"$f":"VLOOKUP(A93,Macronutrients,12,FALSE)*E93+VLOOKUP(A94,Macronutrients,12,FALSE)*E94+VLOOKUP(A95,Macronutrients,12,FALSE)*E95+VLOOKUP(A96,Macronutrients,12,FALSE)*E96+VLOOKUP(A97,Macronutrients,12,FALSE)*E97+VLOOKUP(A98,Macronutrients,12,FALSE)*E98+VLOOKUP(A101,Micronutrients,12,FALSE)*E101+VLOOKUP(A102,Micronutrients,12,FALSE)*E102+VLOOKUP(A103,Micronutrients,12,FALSE)*E103+VLOOKUP(A104,Micronutrients,12,FALSE)*E104","v":0},{"$f":"VLOOKUP(A93,Macronutrients,13,FALSE)*E93+VLOOKUP(A94,Macronutrients,13,FALSE)*E94+VLOOKUP(A95,Macronutrients,13,FALSE)*E95+VLOOKUP(A96,Macronutrients,13,FALSE)*E96+VLOOKUP(A97,Macronutrients,13,FALSE)*E97+VLOOKUP(A98,Macronutrients,13,FALSE)*E98+VLOOKUP(A101,Micronutrients,13,FALSE)*E101+VLOOKUP(A102,Micronutrients,13,FALSE)*E102+VLOOKUP(A103,Micronutrients,13,FALSE)*E103+VLOOKUP(A104,Micronutrients,13,FALSE)*E104","v":0},null,"None",{"$f":"VLOOKUP($M102,Micronutrients,14,FALSE)","v":0},{"$f":"VLOOKUP(M102,Micronutrients,18,FALSE)","v":0},{"$f":"VLOOKUP(M102,Micronutrients,16,FALSE)","v":1},0,{"$f":"VLOOKUP(M102,Micronutrients,15,FALSE)","v":0},{"$f":"(Q102*VLOOKUP(M102,Micronutrients,14,FALSE)/P102)*O102","v":0},null,{"$f":"VLOOKUP(M93,Macronutrients,11,FALSE)*Q93+VLOOKUP(M94,Macronutrients,11,FALSE)*Q94+VLOOKUP(M95,Macronutrients,11,FALSE)*Q95+VLOOKUP(M96,Macronutrients,11,FALSE)*Q96+VLOOKUP(M97,Macronutrients,11,FALSE)*Q97+VLOOKUP(M98,Macronutrients,11,FALSE)*Q98+VLOOKUP(M101,Micronutrients,11,FALSE)*Q101+VLOOKUP(M102,Micronutrients,11,FALSE)*Q102+VLOOKUP(M103,Micronutrients,11,FALSE)*Q103+VLOOKUP(M104,Micronutrients,11,FALSE)*Q104","v":0},{"$f":"VLOOKUP(M93,Macronutrients,12,FALSE)*Q93+VLOOKUP(M94,Macronutrients,12,FALSE)*Q94+VLOOKUP(M95,Macronutrients,12,FALSE)*Q95+VLOOKUP(M96,Macronutrients,12,FALSE)*Q96+VLOOKUP(M97,Macronutrients,12,FALSE)*Q97+VLOOKUP(M98,Macronutrients,12,FALSE)*Q98+VLOOKUP(M101,Micronutrients,12,FALSE)*Q101+VLOOKUP(M102,Micronutrients,12,FALSE)*Q102+VLOOKUP(M103,Micronutrients,12,FALSE)*Q103+VLOOKUP(M104,Micronutrients,12,FALSE)*Q104","v":0},{"$f":"VLOOKUP(M93,Macronutrients,13,FALSE)*Q93+VLOOKUP(M94,Macronutrients,13,FALSE)*Q94+VLOOKUP(M95,Macronutrients,13,FALSE)*Q95+VLOOKUP(M96,Macronutrients,13,FALSE)*Q96+VLOOKUP(M97,Macronutrients,13,FALSE)*Q97+VLOOKUP(M98,Macronutrients,13,FALSE)*Q98+VLOOKUP(M101,Micronutrients,13,FALSE)*Q101+VLOOKUP(M102,Micronutrients,13,FALSE)*Q102+VLOOKUP(M103,Micronutrients,13,FALSE)*Q103+VLOOKUP(M104,Micronutrients,13,FALSE)*Q104","v":0},null,"None",{"$f":"VLOOKUP(Y102,Micronutrients,14,FALSE)","v":0},{"$f":"VLOOKUP(Y102,Micronutrients,18,FALSE)","v":0},{"$f":"VLOOKUP(Y102,Micronutrients,16,FALSE)","v":1},0,{"$f":"VLOOKUP(Y102,Micronutrients,15,FALSE)","v":0},{"$f":"(AC102*VLOOKUP(Y102,Micronutrients,14,FALSE)/AB102)*AA102","v":0},null,{"$f":"VLOOKUP(Y93,Macronutrients,11,FALSE)*AC93+VLOOKUP(Y94,Macronutrients,11,FALSE)*AC94+VLOOKUP(Y95,Macronutrients,11,FALSE)*AC95+VLOOKUP(Y96,Macronutrients,11,FALSE)*AC96+VLOOKUP(Y97,Macronutrients,11,FALSE)*AC97+VLOOKUP(Y98,Macronutrients,11,FALSE)*AC98+VLOOKUP(Y101,Micronutrients,11,FALSE)*AC101+VLOOKUP(Y102,Micronutrients,11,FALSE)*AC102+VLOOKUP(Y103,Micronutrients,11,FALSE)*AC103+VLOOKUP(Y104,Micronutrients,11,FALSE)*AC104","v":0},{"$f":"VLOOKUP(Y93,Macronutrients,12,FALSE)*AC93+VLOOKUP(Y94,Macronutrients,12,FALSE)*AC94+VLOOKUP(Y95,Macronutrients,12,FALSE)*AC95+VLOOKUP(Y96,Macronutrients,12,FALSE)*AC96+VLOOKUP(Y97,Macronutrients,12,FALSE)*AC97+VLOOKUP(Y98,Macronutrients,12,FALSE)*AC98+VLOOKUP(Y101,Micronutrients,12,FALSE)*AC101+VLOOKUP(Y102,Micronutrients,12,FALSE)*AC102+VLOOKUP(Y103,Micronutrients,12,FALSE)*AC103+VLOOKUP(Y104,Micronutrients,12,FALSE)*AC104","v":0},{"$f":"VLOOKUP(Y93,Macronutrients,13,FALSE)*AC93+VLOOKUP(Y94,Macronutrients,13,FALSE)*AC94+VLOOKUP(Y95,Macronutrients,13,FALSE)*AC95+VLOOKUP(Y96,Macronutrients,13,FALSE)*AC96+VLOOKUP(Y97,Macronutrients,13,FALSE)*AC97+VLOOKUP(Y98,Macronutrients,13,FALSE)*AC98+VLOOKUP(Y101,Micronutrients,13,FALSE)*AC101+VLOOKUP(Y102,Micronutrients,13,FALSE)*AC102+VLOOKUP(Y103,Micronutrients,13,FALSE)*AC103+VLOOKUP(Y104,Micronutrients,13,FALSE)*AC104","v":0}]
["None",{"$f":"VLOOKUP($A103,Micronutrients,14,FALSE)","v":0},{"$f":"VLOOKUP(A103,Micronutrients,18,FALSE)","v":0},{"$f":"VLOOKUP(A103,Micronutrients,16,FALSE)","v":1},0,{"$f":"VLOOKUP(A103,Micronutrients,15,FALSE)","v":0},{"$f":"(E103*VLOOKUP(A103,Micronutrients,14,FALSE)/D103)*C103","v":0},null,null,null,null,null,"None",{"$f":"VLOOKUP($M103,Micronutrients,14,FALSE)","v":0},{"$f":"VLOOKUP(M103,Micronutrients,18,FALSE)","v":0},{"$f":"VLOOKUP(M103,Micronutrients,16,FALSE)","v":1},0,{"$f":"VLOOKUP(M103,Micronutrients,15,FALSE)","v":0},{"$f":"(Q103*VLOOKUP(M103,Micronutrients,14,FALSE)/P103)*O103","v":0},null,null,null,null,null,"None",{"$f":"VLOOKUP(Y103,Micronutrients,14,FALSE)","v":0},{"$f":"VLOOKUP(Y103,Micronutrients,18,FALSE)","v":0},{"$f":"VLOOKUP(Y103,Micronutrients,16,FALSE)","v":1},0,{"$f":"VLOOKUP(Y103,Micronutrients,15,FALSE)","v":0},{"$f":"(AC103*VLOOKUP(Y103,Micronutrients,14,FALSE)/AB103)*AA103","v":0}]
["None",{"$f":"VLOOKUP($A104,Micronutrients,14,FALSE)","v":0},{"$f":"VLOOKUP(A104,Micronutrients,18,FALSE)","v":0},{"$f":"VLOOKUP(A104,Micronutrients,16,FALSE)","v":1},0,{"$f":"VLOOKUP(A104,Micronutrients,15,FALSE)","v":0},{"$f":"(E104*VLOOKUP(A104,Micronutrients,14,FALSE)/D104)*C104","v":0},null,null,null,null,null,"None",{"$f":"VLOOKUP($M104,Micronutrients,14,FALSE)","v":0},{"$f":"VLOOKUP(M104,Micronutrients,18,FALSE)","v":0},{"$f":"VLOOKUP(M104,Micronutrients,16,FALSE)","v":1},0,{"$f":"VLOOKUP(M104,Micronutrients,15,FALSE)","v":0},{"$f":"(Q104*VLOOKUP(M104,Micronutrients,14,FALSE)/P104)*O104","v":0},null,null,null,null,null,"None",{"$f":"VLOOKUP(Y104,Micronutrients,14,FALSE)","v":0},{"$f":"VLOOKUP(Y104,Micronutrients,18,FALSE)","v":0},{"$f":"VLOOKUP(Y104,Micronutrients,16,FALSE)","v":1},0,{"$f":"VLOOKUP(Y104,Micronutrients,15,FALSE)","v":0},{"$f":"(AC104*VLOOKUP(Y104,Micronutrients,14,FALSE)/AB104)*AA104","v":0}]
[]
["Nitrogen Stabilizers (drop down menu)",null,null,null,null,null,null,null,null,null,null,null,"Nitrogen Stabilizers (drop down menu)",null,null,null,null,null,null,null,null,null,null,null,"Nitrogen Stabilizers (drop down menu)"]
["None",{"$f":"VLOOKUP(A107,NitrogenStabilizers,14,FALSE)","v":0},{"$f":"VLOOKUP(A107,NitrogenStabilizers,18,FALSE)","v":0},{"$f":"VLOOKUP(A107,NitrogenStabilizers,16,FALSE)","v":1},0,{"$f":"VLOOKUP(A107,NitrogenStabilizers,15,FALSE)","v":0},{"$f":"(E107*VLOOKUP(A107,NitrogenStabilizers,14,FALSE)/D107)*C107","v":0},null,null,null,null,null,"None",{"$f":"VLOOKUP(M107,NitrogenStabilizers,14,FALSE)","v":0},{"$f":"VLOOKUP(M107,NitrogenStabilizers,18,FALSE)","v":0},{"$f":"VLOOKUP(M107,NitrogenStabilizers,16,FALSE)","v":1},0,{"$f":"VLOOKUP(M107,NitrogenStabilizers,15,FALSE)","v":0},{"$f":"(Q107*VLOOKUP(M107,NitrogenStabilizers,14,FALSE)/P107)*O107","v":0},null,null,null,null,null,"None",{"$f":"VLOOKUP(Y107,NitrogenStabilizers,14,FALSE)","v":0},{"$f":"VLOOKUP(Y107,NitrogenStabilizers,18,FALSE)","v":0},{"$f":"VLOOKUP(Y107,NitrogenStabilizers,16,FALSE)","v":1},0,{"$f":"VLOOKUP(Y107,NitrogenStabilizers,15,FALSE)","v":0},{"$f":"(AC107*VLOOKUP(Y107,NitrogenStabilizers,14,FALSE)/AB107)*AA107","v":0}]
["None",{"$f":"VLOOKUP(A108,NitrogenStabilizers,14,FALSE)","v":0},{"$f":"VLOOKUP(A108,NitrogenStabilizers,18,FALSE)","v":0},{"$f":"VLOOKUP(A108,NitrogenStabilizers,16,FALSE)","v":1},0,{"$f":"VLOOKUP(A108,NitrogenStabilizers,15,FALSE)","v":0},{"$f":"(E108*VLOOKUP(A108,NitrogenStabilizers,14,FALSE)/D108)*C108","v":0},null,null,null,null,null,"None",{"$f":"VLOOKUP(M108,NitrogenStabilizers,14,FALSE)","v":0},{"$f":"VLOOKUP(M108,NitrogenStabilizers,18,FALSE)","v":0},{"$f":"VLOOKUP(M108,NitrogenStabilizers,16,FALSE)","v":1},0,{"$f":"VLOOKUP(M108,NitrogenStabilizers,15,FALSE)","v":0},{"$f":"(Q108*VLOOKUP(M108,NitrogenStabilizers,14,FALSE)/P108)*O108","v":0},null,null,null,null,null,"None",{"$f":"VLOOKUP(Y108,NitrogenStabilizers,14,FALSE)","v":0},{"$f":"VLOOKUP(Y108,NitrogenStabilizers,18,FALSE)","v":0},{"$f":"VLOOKUP(Y108,NitrogenStabilizers,16,FALSE)","v":1},0,{"$f":"VLOOKUP(Y108,NitrogenStabilizers,15,FALSE)","v":0},{"$f":"(AC108*VLOOKUP(Y108,NitrogenStabilizers,14,FALSE)/AB108)*AA108","v":0}]
["5th Application Fertilizer Cost/Acre",null,null,null,null,null,{"$f":"SUM(G93:G108)","v":0},null,null,null,null,null,"5th Application Fertilizer Cost/Acre",null,null,null,null,null,{"$f":"SUM(S93:S108)","v":0},null,null,null,null,null,"5th Application Fertilizer Cost/Acre",null,null,null,null,null,{"$f":"SUM(AE93:AE108)","v":0}]
[]
["Total Fertilizer Cost/Acre",null,null,null,null,null,{"$f":"G109+G88+G25+G67+G46","v":0},null,null,null,null,null,"Total Fertilizer Cost/Acre",null,null,null,null,null,{"$f":"S109+S88+S25+S67+S46","v":0},null,null,null,null,null,"Total Fertilizer Cost/Acre",null,null,null,null,null,{"$f":"AE109+AE88+AE25+AE67+AE46","v":0}]
[]
[null,null,null,null,"Total Nutrient Needs",null,null,null,null,null,null,null,null,null,null,null,"Total Nutrient Needs",null,null,null,null,null,null,null,null,null,null,null,"Total Nutrient Needs"]
[null,null,null,null,"Based on:","Soil Test Based Recs",null,null,"Total Fertilizer Program",null,null,null,null,null,null,null,"Based on:","Nutrient Removal",null,null,"Total Fertilizer Program",null,null,null,null,null,null,null,"Based on:","Nutrient Removal",null,null,"Total Fertilizer Program"]
["Farm Name",null,null,null,"N","P","K",null,"N","P","K",null,{"$f":"A115","v":"Farm Name"},null,null,null,"N","P","K",null,"N","P","K",null,{"$f":"A115","v":"Farm Name"},null,null,null,"N","P","K",null,"N","P","K"]
["Farm Tract",null,null,null,{"$f":"'Nutrient Management'!J57","v":0},{"$f":"'Nutrient Management'!K57","v":0},{"$f":"'Nutrient Management'!L57","v":0},null,{"$f":"I6+I30+I51+I72+I93","v":0},{"$f":"J6+J30+J51+J72+J93","v":0},0,null,{"$f":"A116","v":"Farm Tract"},null,null,null,{"$f":"'Nutrient Management'!B69","v":0},{"$f":"'Nutrient Management'!C69","v":0},{"$f":"'Nutrient Management'!D69","v":0},null,{"$f":"U6+U30+U51+U72+U93","v":0},{"$f":"V6+V30+V51+V72+V93","v":0},0,null,{"$f":"A116","v":"Farm Tract"},null,null,null,{"$f":"'Nutrient Management'!B69","v":0},{"$f":"'Nutrient Management'!C57","v":0},{"$f":"'Nutrient Management'!D69","v":0},null,{"$f":"AG6+AG30+AG51+AG72+AG93","v":0},{"$f":"AH6+AH30+AH51+AH72+AH93","v":0},0]
["Farm Number",null,null,null,"S","Ca","Mg",null,"S","Ca","Mg",null,"Farm Number",null,null,null,"S","Ca","Mg",null,"S","Ca","Mg",null,"Farm Number",null,null,null,"S","Ca","Mg",null,"S","Ca","Mg"]
[null,null,null,null,{"$f":"'Nutrient Management'!J60","v":0},{"$f":"'Nutrient Management'!K60","v":0},{"$f":"'Nutrient Management'!L60","v":0},null,{"$f":"I9+I33+I54+I75+I96","v":0},{"$f":"J9+J33+J54+J75+J96","v":0},0,null,null,null,null,null,{"$f":"'Nutrient Management'!B72","v":0},{"$f":"'Nutrient Management'!C72","v":0},{"$f":"'Nutrient Management'!D72","v":0},null,{"$f":"U9+U33+U54+U75+U96","v":0},{"$f":"V9+V33+V54+V75+V96","v":0},0,null,null,null,null,null,{"$f":"'Nutrient Management'!B72","v":0},{"$f":"'Nutrient Management'!C72","v":0},{"$f":"'Nutrient Management'!D72","v":0},null,{"$f":"AG9+AG33+AG54+AG75+AG96","v":0},{"$f":"AH9+AH33+AH54+AH75+AH96","v":0},0]
[null,null,null,null,"Zn","B","Mn",null,"Zn","B","Mn",null,null,null,null,null,"Zn","B","Mn",null,"Zn","B","Mn",null,null,null,null,null,"Zn","B","Mn",null,"Zn","B","Mn"]
[null,null,null,null,{"$f":"'Nutrient Management'!J62","v":0},{"$f":"'Nutrient Management'!K62","v":0},{"$f":"'Nutrient Management'!L62","v":0},null,{"$f":"I12+I36+I57+I78+I99","v":0},{"$f":"J12+J36+J57+J78+J99","v":0},0,null,null,null,null,null,{"$f":"'Nutrient Management'!B74","v":0},{"$f":"'Nutrient Management'!C74","v":0},{"$f":"'Nutrient Management'!D74","v":0},null,{"$f":"U12+U36+U57+U78+U99","v":0},{"$f":"V12+V36+V57+V78+V99","v":0},0,null,null,null,null,null,{"$f":"'Nutrient Management'!B74","v":0},{"$f":"'Nutrient Management'!C74","v":0},{"$f":"'Nutrient Management'!D74","v":0},null,{"$f":"AG12+AG36+AG57+AG78+AG99","v":0},{"$f":"AH12+AH36+AH57+AH78+AH99","v":0},0]
[null,null,null,null,"Cu","Mo","Fe",null,"Cu","Mo","Fe",null,null,null,null,null,"Cu","Mo","Fe",null,"Cu","Mo","Fe",null,null,null,null,null,"Cu","Mo","Fe",null,"Cu","Mo","Fe"]
[null,null,null,null,{"$f":"'Nutrient Management'!J64","v":0},{"$f":"'Nutrient Management'!K64","v":0},{"$f":"'Nutrient Management'!L64","v":0},null,{"$f":"I15+I39+I60+I81+I102","v":0},{"$f":"J15+J39+J60+J81+J102","v":0},0,null,null,null,null,null,{"$f":"'Nutrient Management'!B76","v":0},{"$f":"'Nutrient Management'!C76","v":0},{"$f":"'Nutrient Management'!D76","v":0},null,{"$f":"U15+U39+U60+U81+U102","v":0},{"$f":"V15+V39+V60+V81+V102","v":0},0,null,null,null,null,null,{"$f":"'Nutrient Management'!B76","v":0},{"$f":"'Nutrient Management'!C76","v":0},{"$f":"'Nutrient Management'!D76","v":0},null,{"$f":"AG15+AG39+AG60+AG81+AG102","v":0},{"$f":"AH15+AH39+AH60+AH81+AH102","v":0},0]
[null,null,null,null,"* from Nutrient Management tab",null,null,null,null,null,null,null,null,null,null,null,"* from Nutrient Management tab",null,null,null,null,null,null,null,null,null,null,null,"* from Nutrient Management tab"]

{"sheet":"Product Purchase List (Alfalfa)","index":10,"n_rows":148,"n_cols":14,"rows_kept":148,"cut":false,"hidden":false,"merged":[[0,1,0,3],[0,7,0,13]]}
[null,"Product Purchase List (Alfalfa)",null,null,null,"(Enter Below)",null,"Fertilizer Product Purchase List (Alfalfa)"]
[null,null,null,null,null,"Acres"]
[null,"Fertilizer Product (Macronutrients)","Purchase Quantity","Product Unit",null,100,null,"Macronutrients","Purchase Quantity","Product Unit",null,"Lime","Purchase Quantity","Product Unit"]
[null,{"$f":"'Fertilizer Plan (Alfalfa)'!A6","v":"None"},{"$f":"IFERROR(('Fertilizer Plan (Alfalfa)'!E6*VLOOKUP(B4,Macronutrients,14,FALSE))/VLOOKUP(B4,Macronutrients,16,FALSE)*$F$3,0)","v":0},{"$f":"VLOOKUP(B4,Macronutrients,17,FALSE)","v":{"$error":"#REF!"}},null,null,null,{"$f":"_xlfn._xlws.SORT(_xlfn.LET(_xlpm.a,B4:B21,_xlpm.b,C4:C21,_xlfn.HSTACK(_xlfn.UNIQUE(_xlpm.a),SUMIFS(_xlpm.b,_xlpm.a,_xlfn.UNIQUE(_xlpm.a)))))","v":"None"},0,{"$f":"IFERROR(VLOOKUP(H4,Macronutrients,17,FALSE),\"\")","v":""},null,{"$f":"_xlfn.LET(_xlpm.a,B58,_xlpm.b,C58,_xlfn.HSTACK(_xlfn.UNIQUE(_xlpm.a),SUMIFS(_xlpm.b,_xlpm.a,_xlfn.UNIQUE(_xlpm.a))))","v":"None"},0,{"$f":"IFERROR(VLOOKUP(L4,Lime,17,FALSE),\"\")","v":"None"}]
[null,{"$f":"'Fertilizer Plan (Alfalfa)'!A7","v":"None"},{"$f":"IFERROR(('Fertilizer Plan (Alfalfa)'!E7*VLOOKUP(B5,Macronutrients,14,FALSE))/VLOOKUP(B5,Macronutrients,16,FALSE)*$F$3,0)","v":0},{"$f":"VLOOKUP(B5,Macronutrients,17,FALSE)","v":{"$error":"#REF!"}},null,null,null,null,null,{"$f":"IFERROR(VLOOKUP(H5,Macronutrients,17,FALSE),\"\")","v":""}]
[null,{"$f":"'Fertilizer Plan (Alfalfa)'!A8","v":"None"},{"$f":"IFERROR(('Fertilizer Plan (Alfalfa)'!E8*VLOOKUP(B6,Macronutrients,14,FALSE))/VLOOKUP(B6,Macronutrients,16,FALSE)*$F$3,0)","v":0},{"$error":"#REF!"},null,null,null,null,null,"",null,"Micronutrients","Purchase Quantity","Product Unit"]
[null,{"$f":"'Fertilizer Plan (Alfalfa)'!A9","v":"None"},{"$f":"IFERROR(('Fertilizer Plan (Alfalfa)'!E9*VLOOKUP(B7,Macronutrients,14,FALSE))/VLOOKUP(B7,Macronutrients,16,FALSE)*$F$3,0)","v":0},{"$error":"#REF!"},null,null,null,null,null,"",null,{"$f":"_xlfn._xlws.SORT(_xlfn.LET(_xlpm.a,B36:B47,_xlpm.b,C36:C47,_xlfn.HSTACK(_xlfn.UNIQUE(_xlpm.a),SUMIFS(_xlpm.b,_xlpm.a,_xlfn.UNIQUE(_xlpm.a)))))","v":"None"},0,{"$f":"IFERROR(VLOOKUP(L7,Micronutrients,17,FALSE),\"\")","v":""}]
[null,{"$f":"'Fertilizer Plan (Alfalfa)'!A10","v":"None"},{"$f":"IFERROR(('Fertilizer Plan (Alfalfa)'!E10*VLOOKUP(B8,Macronutrients,14,FALSE))/VLOOKUP(B8,Macronutrients,16,FALSE)*$F$3,0)","v":0},{"$f":"VLOOKUP(B8,Macronutrients,17,FALSE)","v":{"$error":"#REF!"}},null,null,null,null,null,{"$f":"IFERROR(VLOOKUP(H8,Macronutrients,17,FALSE),\"\")","v":""},null,null,null,""]
[null,{"$f":"'Fertilizer Plan (Alfalfa)'!A11","v":"None"},{"$f":"IFERROR(('Fertilizer Plan (Alfalfa)'!E11*VLOOKUP(B9,Macronutrients,14,FALSE))/VLOOKUP(B9,Macronutrients,16,FALSE)*$F$3,0)","v":0},{"$error":"#REF!"},null,null,null,null,null,"",null,null,null,""]
[null,{"$f":"'Fertilizer Plan (Alfalfa)'!A30","v":"None"},{"$f":"IFERROR(('Fertilizer Plan (Alfalfa)'!E30*VLOOKUP(B10,Macronutrients,14,FALSE))/VLOOKUP(10,Macronutrients,16,FALSE)*$F$3,0)","v":0},{"$error":"#REF!"},null,null,null,null,null,"",null,null,null,""]
[null,{"$f":"'Fertilizer Plan (Alfalfa)'!A31","v":"None"},{"$f":"IFERROR(('Fertilizer Plan (Alfalfa)'!E31*VLOOKUP(B11,Macronutrients,14,FALSE))/VLOOKUP(B11,Macronutrients,16,FALSE)*$F$3,0)","v":0},{"$error":"#REF!"},null,null,null,null,null,"",null,null,null,""]
[null,{"$f":"'Fertilizer Plan (Alfalfa)'!A32","v":"None"},{"$f":"IFERROR(('Fertilizer Plan (Alfalfa)'!E32*VLOOKUP(B12,Macronutrients,14,FALSE))/VLOOKUP(B12,Macronutrients,16,FALSE)*$F$3,0)","v":0},{"$error":"#REF!"},null,null,null,null,null,"",null,null,null,""]
[null,{"$f":"'Fertilizer Plan (Alfalfa)'!A33","v":"None"},{"$f":"IFERROR(('Fertilizer Plan (Alfalfa)'!E33*VLOOKUP(B13,Macronutrients,14,FALSE))/VLOOKUP(B13,Macronutrients,16,FALSE)*$F$3,0)","v":0},{"$error":"#REF!"},null,null,null,null,null,"",null,null,null,""]
[null,{"$f":"'Fertilizer Plan (Alfalfa)'!A34","v":"None"},{"$f":"IFERROR(('Fertilizer Plan (Alfalfa)'!E34*VLOOKUP(B14,Macronutrients,14,FALSE))/VLOOKUP(B14,Macronutrients,16,FALSE)*$F$3,0)","v":0},{"$error":"#REF!"},null,null,null,null,null,"",null,null,null,""]
[null,{"$f":"'Fertilizer Plan (Alfalfa)'!A35","v":"None"},{"$f":"IFERROR(('Fertilizer Plan (Alfalfa)'!E35*VLOOKUP(B15,Macronutrients,14,FALSE))/VLOOKUP(B15,Macronutrients,16,FALSE)*$F$3,0)","v":0},{"$error":"#REF!"},null,null,null,null,null,"",null,null,null,""]
[null,{"$f":"'Fertilizer Plan (Alfalfa)'!A51","v":"None"},{"$f":"IFERROR(('Fertilizer Plan (Alfalfa)'!E51*VLOOKUP(B16,Macronutrients,14,FALSE))/VLOOKUP(B16,Macronutrients,16,FALSE)*$F$3,0)","v":0},{"$error":"#REF!"},null,null,null,null,null,"",null,null,null,""]
[null,{"$f":"'Fertilizer Plan (Alfalfa)'!A52","v":"None"},{"$f":"IFERROR(('Fertilizer Plan (Alfalfa)'!E52*VLOOKUP(B17,Macronutrients,14,FALSE))/VLOOKUP(B17,Macronutrients,16,FALSE)*$F$3,0)","v":0},{"$error":"#REF!"},null,null,null,null,null,"",null,null,null,""]
[null,{"$f":"'Fertilizer Plan (Alfalfa)'!A53","v":"None"},{"$f":"IFERROR(('Fertilizer Plan (Alfalfa)'!E53*VLOOKUP(B18,Macronutrients,14,FALSE))/VLOOKUP(B18,Macronutrients,16,FALSE)*$F$3,0)","v":0},{"$error":"#REF!"},null,null,null,null,null,"",null,null,null,""]
[null,{"$f":"'Fertilizer Plan (Alfalfa)'!A54","v":"None"},{"$f":"IFERROR(('Fertilizer Plan (Alfalfa)'!E54*VLOOKUP(B19,Macronutrients,14,FALSE))/VLOOKUP(B19,Macronutrients,16,FALSE)*$F$3,0)","v":0},{"$error":"#REF!"},null,null,null,null,null,"",null,null,null,""]
[null,{"$f":"'Fertilizer Plan (Alfalfa)'!A55","v":"None"},{"$f":"IFERROR(('Fertilizer Plan (Alfalfa)'!E55*VLOOKUP(B20,Macronutrients,14,FALSE))/VLOOKUP(B20,Macronutrients,16,FALSE)*$F$3,0)","v":0},{"$error":"#REF!"},null,null,null,null,null,"",null,null,null,""]
[null,{"$f":"'Fertilizer Plan (Alfalfa)'!A56","v":"None"},{"$f":"IFERROR(('Fertilizer Plan (Alfalfa)'!E56*VLOOKUP(B21,Macronutrients,14,FALSE))/VLOOKUP(B21,Macronutrients,16,FALSE)*$F$3,0)","v":0},{"$error":"#REF!"},null,null,null,null,null,"",null,null,null,""]
[null,{"$f":"'Fertilizer Plan (Alfalfa)'!A72","v":"None"},{"$f":"IFERROR(('Fertilizer Plan (Alfalfa)'!E72*VLOOKUP(B22,Macronutrients,14,FALSE))/VLOOKUP(B22,Macronutrients,16,FALSE)*$F$3,0)","v":0},{"$error":"#REF!"},null,null,null,null,null,"",null,null,null,""]
[null,{"$f":"'Fertilizer Plan (Alfalfa)'!A73","v":"None"},{"$f":"IFERROR(('Fertilizer Plan (Alfalfa)'!E73*VLOOKUP(B23,Macronutrients,14,FALSE))/VLOOKUP(B23,Macronutrients,16,FALSE)*$F$3,0)","v":0},{"$error":"#REF!"},null,null,null,null,null,"",null,null,null,""]
[null,{"$f":"'Fertilizer Plan (Alfalfa)'!A74","v":"None"},{"$f":"IFERROR(('Fertilizer Plan (Alfalfa)'!E74*VLOOKUP(B24,Macronutrients,14,FALSE))/VLOOKUP(B24,Macronutrients,16,FALSE)*$F$3,0)","v":0},{"$error":"#REF!"},null,null,null,null,null,"",null,null,null,""]
[null,{"$f":"'Fertilizer Plan (Alfalfa)'!A75","v":"None"},{"$f":"IFERROR(('Fertilizer Plan (Alfalfa)'!E75*VLOOKUP(B25,Macronutrients,14,FALSE))/VLOOKUP(B25,Macronutrients,16,FALSE)*$F$3,0)","v":0},{"$error":"#REF!"},null,null,null,null,null,"",null,null,null,""]
[null,{"$f":"'Fertilizer Plan (Alfalfa)'!A76","v":"None"},{"$f":"IFERROR(('Fertilizer Plan (Alfalfa)'!E76*VLOOKUP(B26,Macronutrients,14,FALSE))/VLOOKUP(B26,Macronutrients,16,FALSE)*$F$3,0)","v":0},{"$error":"#REF!"},null,null,null,null,null,"",null,null,null,""]
[null,{"$f":"'Fertilizer Plan (Alfalfa)'!A77","v":"None"},{"$f":"IFERROR(('Fertilizer Plan (Alfalfa)'!E77*VLOOKUP(B27,Macronutrients,14,FALSE))/VLOOKUP(B27,Macronutrients,16,FALSE)*$F$3,0)","v":0},{"$error":"#REF!"},null,null,null,null,null,"",null,null,null,""]
[null,{"$f":"'Fertilizer Plan (Alfalfa)'!A93","v":"None"},{"$f":"IFERROR(('Fertilizer Plan (Alfalfa)'!E93*VLOOKUP(B28,Macronutrients,14,FALSE))/VLOOKUP(B28,Macronutrients,16,FALSE)*$F$3,0)","v":0},{"$error":"#REF!"},null,null,null,null,null,"",null,null,null,{"$f":"IFERROR(VLOOKUP(L28,Micronutrients,17,FALSE),\"\")","v":""}]
[null,{"$f":"'Fertilizer Plan (Alfalfa)'!A94","v":"None"},{"$f":"IFERROR(('Fertilizer Plan (Alfalfa)'!E94*VLOOKUP(B29,Macronutrients,14,FALSE))/VLOOKUP(B29,Macronutrients,16,FALSE)*$F$3,0)","v":0},{"$error":"#REF!"},null,null,null,null,null,"",null,null,null,""]
[null,{"$f":"'Fertilizer Plan (Alfalfa)'!A95","v":"None"},{"$f":"IFERROR(('Fertilizer Plan (Alfalfa)'!E95*VLOOKUP(B30,Macronutrients,14,FALSE))/VLOOKUP(B30,Macronutrients,16,FALSE)*$F$3,0)","v":0},{"$error":"#REF!"},null,null,null,null,null,"",null,null,null,""]
[null,{"$f":"'Fertilizer Plan (Alfalfa)'!A96","v":"None"},{"$f":"IFERROR(('Fertilizer Plan (Alfalfa)'!E96*VLOOKUP(B31,Macronutrients,14,FALSE))/VLOOKUP(B31,Macronutrients,16,FALSE)*$F$3,0)","v":0},{"$error":"#REF!"},null,null,null,null,null,"",null,null,null,""]
[null,{"$f":"'Fertilizer Plan (Alfalfa)'!A97","v":"None"},{"$f":"IFERROR(('Fertilizer Plan (Alfalfa)'!E97*VLOOKUP(B32,Macronutrients,14,FALSE))/VLOOKUP(B32,Macronutrients,16,FALSE)*$F$3,0)","v":0},{"$error":"#REF!"},null,null,null,null,null,"",null,null,null,""]
[null,{"$f":"'Fertilizer Plan (Alfalfa)'!A98","v":"None"},{"$f":"IFERROR(('Fertilizer Plan (Alfalfa)'!E98*VLOOKUP(B33,Macronutrients,14,FALSE))/VLOOKUP(B33,Macronutrients,16,FALSE)*$F$3,0)","v":0},{"$error":"#REF!"},null,null,null,null,null,"",null,null,null,""]
[null,null,null,null,null,null,null,null,null,"",null,null,null,""]
[null,"Fertilizer Product (Micronutrients)","Purchase Quantity","Product Unit",null,null,null,null,null,{"$f":"IFERROR(VLOOKUP(H35,Macronutrients,17,FALSE),\"\")","v":""},null,null,null,""]
[null,{"$f":"'Fertilizer Plan (Alfalfa)'!A14","v":"None"},{"$f":"IFERROR(('Fertilizer Plan (Alfalfa)'!E14*VLOOKUP(B36,Micronutrients,14,FALSE))/VLOOKUP(B36,Micronutrients,16,FALSE)*$F$3,0)","v":0},{"$f":"VLOOKUP(B36,Micronutrients,17,FALSE)","v":{"$error":"#REF!"}},null,null,null,null,null,"",null,null,null,""]
[null,{"$f":"'Fertilizer Plan (Alfalfa)'!A15","v":"None"},{"$f":"IFERROR(('Fertilizer Plan (Alfalfa)'!E15*VLOOKUP(B37,Micronutrients,14,FALSE))/VLOOKUP(B37,Micronutrients,16,FALSE)*$F$3,0)","v":0},{"$f":"VLOOKUP(B37,Micronutrients,17,FALSE)","v":{"$error":"#REF!"}},null,null,null,null,null,"",null,null,null,""]
[null,{"$f":"'Fertilizer Plan (Alfalfa)'!A16","v":"None"},{"$f":"IFERROR(('Fertilizer Plan (Alfalfa)'!E16*VLOOKUP(B38,Micronutrients,14,FALSE))/VLOOKUP(B38,Micronutrients,16,FALSE)*$F$3,0)","v":0},{"$error":"#REF!"},null,null,null,null,null,"",null,null,null,""]
[null,{"$f":"'Fertilizer Plan (Alfalfa)'!A17","v":"None"},{"$f":"IFERROR(('Fertilizer Plan (Alfalfa)'!E17*VLOOKUP(B39,Micronutrients,14,FALSE))/VLOOKUP(B39,Micronutrients,16,FALSE)*$F$3,0)","v":0},{"$error":"#REF!"},null,null,null,null,null,"",null,null,null,""]
[null,{"$f":"'Fertilizer Plan (Alfalfa)'!A38","v":"None"},{"$f":"IFERROR(('Fertilizer Plan (Alfalfa)'!E38*VLOOKUP(B40,Micronutrients,14,FALSE))/VLOOKUP(B40,Micronutrients,16,FALSE)*$F$3,0)","v":0},{"$error":"#REF!"},null,null,null,null,null,"",null,null,null,""]
[null,{"$f":"'Fertilizer Plan (Alfalfa)'!A39","v":"None"},{"$f":"IFERROR(('Fertilizer Plan (Alfalfa)'!E39*VLOOKUP(B41,Micronutrients,14,FALSE))/VLOOKUP(B41,Micronutrients,16,FALSE)*$F$3,0)","v":0},{"$f":"VLOOKUP(B41,Micronutrients,17,FALSE)","v":{"$error":"#REF!"}},null,null,null,null,null,"",null,null,null,""]
[null,{"$f":"'Fertilizer Plan (Alfalfa)'!A40","v":"None"},{"$f":"IFERROR(('Fertilizer Plan (Alfalfa)'!E40*VLOOKUP(B42,Micronutrients,14,FALSE))/VLOOKUP(B42,Micronutrients,16,FALSE)*$F$3,0)","v":0},{"$error":"#REF!"},null,null,null,null,null,"",null,null,null,""]
[null,{"$f":"'Fertilizer Plan (Alfalfa)'!A41","v":"None"},{"$f":"IFERROR(('Fertilizer Plan (Alfalfa)'!E41*VLOOKUP(B43,Micronutrients,14,FALSE))/VLOOKUP(B43,Micronutrients,16,FALSE)*$F$3,0)","v":0},{"$error":"#REF!"},null,null,null,null,null,"",null,null,null,""]
[null,{"$f":"'Fertilizer Plan (Alfalfa)'!A59","v":"None"},{"$f":"IFERROR(('Fertilizer Plan (Alfalfa)'!E59*VLOOKUP(B44,Micronutrients,14,FALSE))/VLOOKUP(B44,Micronutrients,16,FALSE)*$F$3,0)","v":0},{"$error":"#REF!"},null,null,null,null,null,"",null,null,null,""]
[null,{"$f":"'Fertilizer Plan (Alfalfa)'!A60","v":"None"},{"$f":"IFERROR(('Fertilizer Plan (Alfalfa)'!E60*VLOOKUP(B45,Micronutrients,14,FALSE))/VLOOKUP(B45,Micronutrients,16,FALSE)*$F$3,0)","v":0},{"$f":"VLOOKUP(B45,Micronutrients,17,FALSE)","v":{"$error":"#REF!"}},null,null,null,null,null,"",null,null,null,""]
[null,{"$f":"'Fertilizer Plan (Alfalfa)'!A61","v":"None"},{"$f":"IFERROR(('Fertilizer Plan (Alfalfa)'!E61*VLOOKUP(B46,Micronutrients,14,FALSE))/VLOOKUP(B46,Micronutrients,16,FALSE)*$F$3,0)","v":0},{"$error":"#REF!"},null,null,null,null,null,"",null,null,null,""]
[null,{"$f":"'Fertilizer Plan (Alfalfa)'!A62","v":"None"},{"$f":"IFERROR(('Fertilizer Plan (Alfalfa)'!E62*VLOOKUP(B47,Micronutrients,14,FALSE))/VLOOKUP(B47,Micronutrients,16,FALSE)*$F$3,0)","v":0},{"$error":"#REF!"},null,null,null,null,null,"",null,null,null,""]
[null,{"$f":"'Fertilizer Plan (Alfalfa)'!A80","v":"None"},{"$f":"IFERROR(('Fertilizer Plan (Alfalfa)'!E80*VLOOKUP(B48,Micronutrients,14,FALSE))/VLOOKUP(B48,Micronutrients,16,FALSE)*$F$3,0)","v":0},{"$error":"#REF!"},null,null,null,null,null,"",null,null,null,""]
[null,{"$f":"'Fertilizer Plan (Alfalfa)'!A81","v":"None"},{"$f":"IFERROR(('Fertilizer Plan (Alfalfa)'!E81*VLOOKUP(B49,Micronutrients,14,FALSE))/VLOOKUP(B49,Micronutrients,16,FALSE)*$F$3,0)","v":0},{"$f":"VLOOKUP(B49,Micronutrients,17,FALSE)","v":{"$error":"#REF!"}},null,null,null,null,null,"",null,null,null,""]
[null,{"$f":"'Fertilizer Plan (Alfalfa)'!A82","v":"None"},{"$f":"IFERROR(('Fertilizer Plan (Alfalfa)'!E82*VLOOKUP(B50,Micronutrients,14,FALSE))/VLOOKUP(B50,Micronutrients,16,FALSE)*$F$3,0)","v":0},{"$error":"#REF!"},null,null,null,null,null,"",null,null,null,""]
[null,{"$f":"'Fertilizer Plan (Alfalfa)'!A83","v":"None"},{"$f":"IFERROR(('Fertilizer Plan (Alfalfa)'!E83*VLOOKUP(B51,Micronutrients,14,FALSE))/VLOOKUP(B51,Micronutrients,16,FALSE)*$F$3,0)","v":0},{"$error":"#REF!"},null,null,null,null,null,"",null,null,null,""]
[null,{"$f":"'Fertilizer Plan (Alfalfa)'!A101","v":"None"},{"$f":"IFERROR(('Fertilizer Plan (Alfalfa)'!E101*VLOOKUP(B52,Micronutrients,14,FALSE))/VLOOKUP(B52,Micronutrients,16,FALSE)*$F$3,0)","v":0},{"$error":"#REF!"},null,null,null,null,null,"",null,null,null,""]
[null,{"$f":"'Fertilizer Plan (Alfalfa)'!A102","v":"None"},{"$f":"IFERROR(('Fertilizer Plan (Alfalfa)'!E102*VLOOKUP(B53,Micronutrients,14,FALSE))/VLOOKUP(B53,Micronutrients,16,FALSE)*$F$3,0)","v":0},{"$f":"VLOOKUP(B53,Micronutrients,17,FALSE)","v":{"$error":"#REF!"}},null,null,null,null,null,"",null,null,null,""]
[null,{"$f":"'Fertilizer Plan (Alfalfa)'!A103","v":"None"},{"$f":"IFERROR(('Fertilizer Plan (Alfalfa)'!E103*VLOOKUP(B54,Micronutrients,14,FALSE))/VLOOKUP(B54,Micronutrients,16,FALSE)*$F$3,0)","v":0},{"$error":"#REF!"},null,null,null,null,null,"",null,null,null,""]
[null,{"$f":"'Fertilizer Plan (Alfalfa)'!A104","v":"None"},{"$f":"IFERROR(('Fertilizer Plan (Alfalfa)'!E20*VLOOKUP(B58,Lime,14,FALSE))/VLOOKUP(B58,Lime,16,FALSE)*$F$3,0)","v":0},{"$error":"#REF!"},null,null,null,null,null,"",null,null,null,""]
[null,null,null,null,null,null,null,null,null,"",null,null,null,""]
[null,"Fertilizer Product (Lime)","Purchase Quantity","Product Unit",null,null,null,null,null,"",null,null,null,""]
[null,{"$f":"'Fertilizer Plan (Alfalfa)'!A20","v":"None"},{"$f":"IFERROR(('Fertilizer Plan (Alfalfa)'!E20*VLOOKUP(B58,Lime,14,FALSE))/VLOOKUP(B58,Lime,16,FALSE)*$F$3,0)","v":0},{"$f":"VLOOKUP(B58,Lime,17,FALSE)","v":"None"},null,null,null,null,null,"",null,null,null,""]
[null,null,null,null,null,null,null,null,null,"",null,null,null,""]
[null,null,null,null,null,null,null,null,null,"",null,null,null,""]
[null,null,null,null,null,null,null,null,null,"",null,null,null,""]
[null,null,null,null,null,null,null,null,null,"",null,null,null,""]
[null,null,null,null,null,null,null,null,null,"",null,null,null,""]
[null,null,null,null,null,null,null,null,null,"",null,null,null,""]
[null,null,null,null,null,null,null,null,null,"",null,null,null,""]
[null,null,null,null,null,null,null,null,null,"",null,null,null,""]
[null,null,null,null,null,null,null,null,null,"",null,null,null,""]
[null,null,null,null,null,null,null,null,null,"",null,null,null,""]
[null,null,null,null,null,null,null,null,null,"",null,null,null,""]
[null,null,null,null,null,null,null,null,null,"",null,null,null,""]
[null,null,null,null,null,null,null,null,null,"",null,null,null,""]
[null,null,null,null,null,null,null,null,null,"",null,null,null,""]
[null,null,null,null,null,null,null,null,null,"",null,null,null,""]
[null,null,null,null,null,null,null,null,null,{"$f":"IFERROR(VLOOKUP(H74,Macronutrients,17,FALSE),\"\")","v":""},null,null,null,{"$f":"IFERROR(VLOOKUP(L74,Micronutrients,17,FALSE),\"\")","v":""}]
[null,null,null,null,null,null,null,null,null,"",null,null,null,""]
[null,null,null,null,null,null,null,null,null,"",null,null,null,""]
[null,null,null,null,null,null,null,null,null,"",null,null,null,""]
[null,null,null,null,null,null,null,null,null,"",null,null,null,""]
[null,null,null,null,null,null,null,null,null,"",null,null,null,""]
[null,null,null,null,null,null,null,null,null,"",null,null,null,""]
[null,null,null,null,null,null,null,null,null,"",null,null,null,""]
[null,null,null,null,null,null,null,null,null,"",null,null,null,""]
[null,null,null,null,null,null,null,null,null,"",null,null,null,""]
[null,null,null,null,null,null,null,null,null,"",null,null,null,""]
[null,null,null,null,null,null,null,null,null,"",null,null,null,""]
[null,null,null,null,null,null,null,null,null,"",null,null,null,""]
[null,null,null,null,null,null,null,null,null,"",null,null,null,""]
[null,null,null,null,null,null,null,null,null,"",null,null,null,""]
[null,null,null,null,null,null,null,null,null,"",null,null,null,""]
[null,null,null,null,null,null,null,null,null,"",null,null,null,""]
[null,null,null,null,null,null,null,null,null,"",null,null,null,""]
[null,null,null,null,null,null,null,null,null,"",null,null,null,""]
[null,null,null,null,null,null,null,null,null,"",null,null,null,""]
[null,null,null,null,null,null,null,null,null,"",null,null,null,""]
[null,null,null,null,null,null,null,null,null,"",null,null,null,""]
[null,null,null,null,null,null,null,null,null,"",null,null,null,""]
[null,null,null,null,null,null,null,null,null,"",null,null,null,""]
[null,null,null,null,null,null,null,null,null,"",null,null,null,""]
[null,null,null,null,null,null,null,null,null,"",null,null,null,""]
[null,null,null,null,null,null,null,null,null,"",null,null,null,""]
[null,null,null,null,null,null,null,null,null,"",null,null,null,""]
[null,null,null,null,null,null,null,null,null,"",null,null,null,""]
[null,null,null,null,null,null,null,null,null,"",null,null,null,""]
[null,null,null,null,null,null,null,null,null,"",null,null,null,""]
[null,null,null,null,null,null,null,null,null,"",null,null,null,""]
[null,null,null,null,null,null,null,null,null,"",null,null,null,""]
[null,null,null,null,null,null,null,null,null,"",null,null,null,""]
[null,null,null,null,null,null,null,null,null,"",null,null,null,""]
[null,null,null,null,null,null,null,null,null,"",null,null,null,""]
[null,null,null,null,null,null,null,null,null,"",null,null,null,""]
[null,null,null,null,null,null,null,null,null,"",null,null,null,""]
[null,null,null,null,null,null,null,null,null,"",null,null,null,""]
[null,null,null,null,null,null,null,null,null,"",null,null,null,""]
[null,null,null,null,null,null,null,null,null,"",null,null,null,""]
[null,null,null,null,null,null,null,null,null,"",null,null,null,""]
[null,null,null,null,null,null,null,null,null,"",null,null,null,""]
[null,null,null,null,null,null,null,null,null,"",null,null,null,""]
[null,null,null,null,null,null,null,null,null,"",null,null,null,""]
[null,null,null,null,null,null,null,null,null,"",null,null,null,""]
[null,null,null,null,null,null,null,null,null,"",null,null,null,""]
[null,null,null,null,null,null,null,null,null,"",null,null,null,""]
[null,null,null,null,null,null,null,null,null,"",null,null,null,""]
[null,null,null,null,null,null,null,null,null,"",null,null,null,""]
[null,null,null,null,null,null,null,null,null,"",null,null,null,""]
[null,null,null,null,null,null,null,null,null,"",null,null,null,""]
[null,null,null,null,null,null,null,null,null,"",null,null,null,""]
[null,null,null,null,null,null,null,null,null,"",null,null,null,""]
[null,null,null,null,null,null,null,null,null,"",null,null,null,""]
[null,null,null,null,null,null,null,null,null,"",null,null,null,""]
[null,null,null,null,null,null,null,null,null,"",null,null,null,""]
[null,null,null,null,null,null,null,null,null,"",null,null,null,""]
[null,null,null,null,null,null,null,null,null,"",null,null,null,""]
[null,null,null,null,null,null,null,null,null,"",null,null,null,""]
[null,null,null,null,null,null,null,null,null,"",null,null,null,""]
[null,null,null,null,null,null,null,null,null,"",null,null,null,""]
[null,null,null,null,null,null,null,null,null,"",null,null,null,""]
[null,null,null,null,null,null,null,null,null,"",null,null,null,""]
[null,null,null,null,null,null,null,null,null,{"$f":"IFERROR(VLOOKUP(H138,Macronutrients,17,FALSE),\"\")","v":""},null,null,null,{"$f":"IFERROR(VLOOKUP(L138,Micronutrients,17,FALSE),\"\")","v":""}]
[null,null,null,null,null,null,null,null,null,"",null,null,null,""]
[null,null,null,null,null,null,null,null,null,"",null,null,null,""]
[null,null,null,null,null,null,null,null,null,"",null,null,null,""]
[null,null,null,null,null,null,null,null,null,"",null,null,null,""]
[null,null,null,null,null,null,null,null,null,"",null,null,null,""]
[null,null,null,null,null,null,null,null,null,"",null,null,null,""]
[null,null,null,null,null,null,null,null,null,"",null,null,null,""]
[null,null,null,null,null,null,null,null,null,"",null,null,null,""]
[null,null,null,null,null,null,null,null,null,"",null,null,null,""]
[null,null,null,null,null,null,null,null,null,"",null,null,null,""]

{"sheet":"Product Purchase List (A&G Mix)","index":11,"n_rows":148,"n_cols":14,"rows_kept":148,"cut":false,"hidden":false,"merged":[[0,1,0,3],[0,7,0,13]]}
[null,"Product Purchase List (Alfalfa-Grass)",null,null,null,"(Enter Below)",null,"Fertilizer Product Purchase List (Alfalfa-Grass)"]
[null,null,null,null,null,"Acres"]
[null,"Fertilizer Product (Macronutrients)","Purchase Quantity","Product Unit",null,100,null,"Macronutrients","Purchase Quantity","Product Unit",null,"Lime","Purchase Quantity","Product Unit"]
[null,{"$f":"'Fertilizer Plan (Alfalfa-Grass)'!A6","v":"None"},{"$f":"IFERROR(('Fertilizer Plan (Alfalfa-Grass)'!E6*VLOOKUP(B4,Macronutrients,14,FALSE))/VLOOKUP(B4,Macronutrients,16,FALSE)*$F$3,0)","v":0},{"$f":"VLOOKUP(B4,Macronutrients,17,FALSE)","v":{"$error":"#REF!"}},null,null,null,{"$f":"_xlfn._xlws.SORT(_xlfn.LET(_xlpm.a,B4:B21,_xlpm.b,C4:C21,_xlfn.HSTACK(_xlfn.UNIQUE(_xlpm.a),SUMIFS(_xlpm.b,_xlpm.a,_xlfn.UNIQUE(_xlpm.a)))))","v":"None"},0,{"$f":"IFERROR(VLOOKUP(H4,Macronutrients,17,FALSE),\"\")","v":""},null,{"$f":"_xlfn.LET(_xlpm.a,B58,_xlpm.b,C58,_xlfn.HSTACK(_xlfn.UNIQUE(_xlpm.a),SUMIFS(_xlpm.b,_xlpm.a,_xlfn.UNIQUE(_xlpm.a))))","v":"None"},0,{"$f":"IFERROR(VLOOKUP(L4,Lime,17,FALSE),\"\")","v":"None"}]
[null,{"$f":"'Fertilizer Plan (Alfalfa-Grass)'!A7","v":"None"},{"$f":"IFERROR(('Fertilizer Plan (Alfalfa-Grass)'!E7*VLOOKUP(B5,Macronutrients,14,FALSE))/VLOOKUP(B5,Macronutrients,16,FALSE)*$F$3,0)","v":0},{"$f":"VLOOKUP(B5,Macronutrients,17,FALSE)","v":{"$error":"#REF!"}},null,null,null,null,null,{"$f":"IFERROR(VLOOKUP(H5,Macronutrients,17,FALSE),\"\")","v":""}]
[null,{"$f":"'Fertilizer Plan (Alfalfa-Grass)'!A8","v":"None"},{"$f":"IFERROR(('Fertilizer Plan (Alfalfa-Grass)'!E8*VLOOKUP(B6,Macronutrients,14,FALSE))/VLOOKUP(B6,Macronutrients,16,FALSE)*$F$3,0)","v":0},{"$error":"#REF!"},null,null,null,null,null,"",null,"Micronutrients","Purchase Quantity","Product Unit"]
[null,{"$f":"'Fertilizer Plan (Alfalfa-Grass)'!A9","v":"None"},{"$f":"IFERROR(('Fertilizer Plan (Alfalfa-Grass)'!E9*VLOOKUP(B7,Macronutrients,14,FALSE))/VLOOKUP(B7,Macronutrients,16,FALSE)*$F$3,0)","v":0},{"$error":"#REF!"},null,null,null,null,null,"",null,{"$f":"_xlfn._xlws.SORT(_xlfn.LET(_xlpm.a,B36:B47,_xlpm.b,C36:C47,_xlfn.HSTACK(_xlfn.UNIQUE(_xlpm.a),SUMIFS(_xlpm.b,_xlpm.a,_xlfn.UNIQUE(_xlpm.a)))))","v":"None"},0,{"$f":"IFERROR(VLOOKUP(L7,Micronutrients,17,FALSE),\"\")","v":""}]
[null,{"$f":"'Fertilizer Plan (Alfalfa-Grass)'!A10","v":"None"},{"$f":"IFERROR(('Fertilizer Plan (Alfalfa-Grass)'!E10*VLOOKUP(B8,Macronutrients,14,FALSE))/VLOOKUP(B8,Macronutrients,16,FALSE)*$F$3,0)","v":0},{"$f":"VLOOKUP(B8,Macronutrients,17,FALSE)","v":{"$error":"#REF!"}},null,null,null,null,null,{"$f":"IFERROR(VLOOKUP(H8,Macronutrients,17,FALSE),\"\")","v":""},null,null,null,""]
[null,{"$f":"'Fertilizer Plan (Alfalfa-Grass)'!A11","v":"None"},{"$f":"IFERROR(('Fertilizer Plan (Alfalfa-Grass)'!E11*VLOOKUP(B9,Macronutrients,14,FALSE))/VLOOKUP(B9,Macronutrients,16,FALSE)*$F$3,0)","v":0},{"$error":"#REF!"},null,null,null,null,null,"",null,null,null,""]
[null,{"$f":"'Fertilizer Plan (Alfalfa-Grass)'!A30","v":"None"},{"$f":"IFERROR(('Fertilizer Plan (Alfalfa-Grass)'!E30*VLOOKUP(B10,Macronutrients,14,FALSE))/VLOOKUP(10,Macronutrients,16,FALSE)*$F$3,0)","v":0},{"$error":"#REF!"},null,null,null,null,null,"",null,null,null,""]
[null,{"$f":"'Fertilizer Plan (Alfalfa-Grass)'!A31","v":"None"},{"$f":"IFERROR(('Fertilizer Plan (Alfalfa-Grass)'!E31*VLOOKUP(B11,Macronutrients,14,FALSE))/VLOOKUP(B11,Macronutrients,16,FALSE)*$F$3,0)","v":0},{"$error":"#REF!"},null,null,null,null,null,"",null,null,null,""]
[null,{"$f":"'Fertilizer Plan (Alfalfa-Grass)'!A32","v":"None"},{"$f":"IFERROR(('Fertilizer Plan (Alfalfa-Grass)'!E32*VLOOKUP(B12,Macronutrients,14,FALSE))/VLOOKUP(B12,Macronutrients,16,FALSE)*$F$3,0)","v":0},{"$error":"#REF!"},null,null,null,null,null,"",null,null,null,""]
[null,{"$f":"'Fertilizer Plan (Alfalfa-Grass)'!A33","v":"None"},{"$f":"IFERROR(('Fertilizer Plan (Alfalfa-Grass)'!E33*VLOOKUP(B13,Macronutrients,14,FALSE))/VLOOKUP(B13,Macronutrients,16,FALSE)*$F$3,0)","v":0},{"$error":"#REF!"},null,null,null,null,null,"",null,null,null,""]
[null,{"$f":"'Fertilizer Plan (Alfalfa-Grass)'!A34","v":"None"},{"$f":"IFERROR(('Fertilizer Plan (Alfalfa-Grass)'!E34*VLOOKUP(B14,Macronutrients,14,FALSE))/VLOOKUP(B14,Macronutrients,16,FALSE)*$F$3,0)","v":0},{"$error":"#REF!"},null,null,null,null,null,"",null,null,null,""]
[null,{"$f":"'Fertilizer Plan (Alfalfa-Grass)'!A35","v":"None"},{"$f":"IFERROR(('Fertilizer Plan (Alfalfa-Grass)'!E35*VLOOKUP(B15,Macronutrients,14,FALSE))/VLOOKUP(B15,Macronutrients,16,FALSE)*$F$3,0)","v":0},{"$error":"#REF!"},null,null,null,null,null,"",null,null,null,""]
[null,{"$f":"'Fertilizer Plan (Alfalfa-Grass)'!A51","v":"None"},{"$f":"IFERROR(('Fertilizer Plan (Alfalfa-Grass)'!E51*VLOOKUP(B16,Macronutrients,14,FALSE))/VLOOKUP(B16,Macronutrients,16,FALSE)*$F$3,0)","v":0},{"$error":"#REF!"},null,null,null,null,null,"",null,null,null,""]
[null,{"$f":"'Fertilizer Plan (Alfalfa-Grass)'!A52","v":"None"},{"$f":"IFERROR(('Fertilizer Plan (Alfalfa-Grass)'!E52*VLOOKUP(B17,Macronutrients,14,FALSE))/VLOOKUP(B17,Macronutrients,16,FALSE)*$F$3,0)","v":0},{"$error":"#REF!"},null,null,null,null,null,"",null,null,null,""]
[null,{"$f":"'Fertilizer Plan (Alfalfa-Grass)'!A53","v":"None"},{"$f":"IFERROR(('Fertilizer Plan (Alfalfa-Grass)'!E53*VLOOKUP(B18,Macronutrients,14,FALSE))/VLOOKUP(B18,Macronutrients,16,FALSE)*$F$3,0)","v":0},{"$error":"#REF!"},null,null,null,null,null,"",null,null,null,""]
[null,{"$f":"'Fertilizer Plan (Alfalfa-Grass)'!A54","v":"None"},{"$f":"IFERROR(('Fertilizer Plan (Alfalfa-Grass)'!E54*VLOOKUP(B19,Macronutrients,14,FALSE))/VLOOKUP(B19,Macronutrients,16,FALSE)*$F$3,0)","v":0},{"$error":"#REF!"},null,null,null,null,null,"",null,null,null,""]
[null,{"$f":"'Fertilizer Plan (Alfalfa-Grass)'!A55","v":"None"},{"$f":"IFERROR(('Fertilizer Plan (Alfalfa-Grass)'!E55*VLOOKUP(B20,Macronutrients,14,FALSE))/VLOOKUP(B20,Macronutrients,16,FALSE)*$F$3,0)","v":0},{"$error":"#REF!"},null,null,null,null,null,"",null,null,null,""]
[null,{"$f":"'Fertilizer Plan (Alfalfa-Grass)'!A56","v":"None"},{"$f":"IFERROR(('Fertilizer Plan (Alfalfa-Grass)'!E56*VLOOKUP(B21,Macronutrients,14,FALSE))/VLOOKUP(B21,Macronutrients,16,FALSE)*$F$3,0)","v":0},{"$error":"#REF!"},null,null,null,null,null,"",null,null,null,""]
[null,{"$f":"'Fertilizer Plan (Alfalfa-Grass)'!A72","v":"None"},{"$f":"IFERROR(('Fertilizer Plan (Alfalfa-Grass)'!E72*VLOOKUP(B22,Macronutrients,14,FALSE))/VLOOKUP(B22,Macronutrients,16,FALSE)*$F$3,0)","v":0},{"$error":"#REF!"},null,null,null,null,null,"",null,null,null,""]
[null,{"$f":"'Fertilizer Plan (Alfalfa-Grass)'!A73","v":"None"},{"$f":"IFERROR(('Fertilizer Plan (Alfalfa-Grass)'!E73*VLOOKUP(B23,Macronutrients,14,FALSE))/VLOOKUP(B23,Macronutrients,16,FALSE)*$F$3,0)","v":0},{"$error":"#REF!"},null,null,null,null,null,"",null,null,null,""]
[null,{"$f":"'Fertilizer Plan (Alfalfa-Grass)'!A74","v":"None"},{"$f":"IFERROR(('Fertilizer Plan (Alfalfa-Grass)'!E74*VLOOKUP(B24,Macronutrients,14,FALSE))/VLOOKUP(B24,Macronutrients,16,FALSE)*$F$3,0)","v":0},{"$error":"#REF!"},null,null,null,null,null,"",null,null,null,""]
[null,{"$f":"'Fertilizer Plan (Alfalfa-Grass)'!A75","v":"None"},{"$f":"IFERROR(('Fertilizer Plan (Alfalfa-Grass)'!E75*VLOOKUP(B25,Macronutrients,14,FALSE))/VLOOKUP(B25,Macronutrients,16,FALSE)*$F$3,0)","v":0},{"$error":"#REF!"},null,null,null,null,null,"",null,null,null,""]
[null,{"$f":"'Fertilizer Plan (Alfalfa-Grass)'!A76","v":"None"},{"$f":"IFERROR(('Fertilizer Plan (Alfalfa-Grass)'!E76*VLOOKUP(B26,Macronutrients,14,FALSE))/VLOOKUP(B26,Macronutrients,16,FALSE)*$F$3,0)","v":0},{"$error":"#REF!"},null,null,null,null,null,"",null,null,null,""]
[null,{"$f":"'Fertilizer Plan (Alfalfa-Grass)'!A77","v":"None"},{"$f":"IFERROR(('Fertilizer Plan (Alfalfa-Grass)'!E77*VLOOKUP(B27,Macronutrients,14,FALSE))/VLOOKUP(B27,Macronutrients,16,FALSE)*$F$3,0)","v":0},{"$error":"#REF!"},null,null,null,null,null,"",null,null,null,""]
[null,{"$f":"'Fertilizer Plan (Alfalfa-Grass)'!A93","v":"None"},{"$f":"IFERROR(('Fertilizer Plan (Alfalfa-Grass)'!E93*VLOOKUP(B28,Macronutrients,14,FALSE))/VLOOKUP(B28,Macronutrients,16,FALSE)*$F$3,0)","v":0},{"$error":"#REF!"},null,null,null,null,null,"",null,null,null,{"$f":"IFERROR(VLOOKUP(L28,Micronutrients,17,FALSE),\"\")","v":""}]
[null,{"$f":"'Fertilizer Plan (Alfalfa-Grass)'!A94","v":"None"},{"$f":"IFERROR(('Fertilizer Plan (Alfalfa-Grass)'!E94*VLOOKUP(B29,Macronutrients,14,FALSE))/VLOOKUP(B29,Macronutrients,16,FALSE)*$F$3,0)","v":0},{"$error":"#REF!"},null,null,null,null,null,"",null,null,null,""]
[null,{"$f":"'Fertilizer Plan (Alfalfa-Grass)'!A95","v":"None"},{"$f":"IFERROR(('Fertilizer Plan (Alfalfa-Grass)'!E95*VLOOKUP(B30,Macronutrients,14,FALSE))/VLOOKUP(B30,Macronutrients,16,FALSE)*$F$3,0)","v":0},{"$error":"#REF!"},null,null,null,null,null,"",null,null,null,""]
[null,{"$f":"'Fertilizer Plan (Alfalfa-Grass)'!A96","v":"None"},{"$f":"IFERROR(('Fertilizer Plan (Alfalfa-Grass)'!E96*VLOOKUP(B31,Macronutrients,14,FALSE))/VLOOKUP(B31,Macronutrients,16,FALSE)*$F$3,0)","v":0},{"$error":"#REF!"},null,null,null,null,null,"",null,null,null,""]
[null,{"$f":"'Fertilizer Plan (Alfalfa-Grass)'!A97","v":"None"},{"$f":"IFERROR(('Fertilizer Plan (Alfalfa-Grass)'!E97*VLOOKUP(B32,Macronutrients,14,FALSE))/VLOOKUP(B32,Macronutrients,16,FALSE)*$F$3,0)","v":0},{"$error":"#REF!"},null,null,null,null,null,"",null,null,null,""]
[null,{"$f":"'Fertilizer Plan (Alfalfa-Grass)'!A98","v":"None"},{"$f":"IFERROR(('Fertilizer Plan (Alfalfa-Grass)'!E98*VLOOKUP(B33,Macronutrients,14,FALSE))/VLOOKUP(B33,Macronutrients,16,FALSE)*$F$3,0)","v":0},{"$error":"#REF!"},null,null,null,null,null,"",null,null,null,""]
[null,null,null,null,null,null,null,null,null,"",null,null,null,""]
[null,"Fertilizer Product (Micronutrients)","Purchase Quantity","Product Unit",null,null,null,null,null,{"$f":"IFERROR(VLOOKUP(H35,Macronutrients,17,FALSE),\"\")","v":""},null,null,null,""]
[null,{"$f":"'Fertilizer Plan (Alfalfa-Grass)'!A14","v":"None"},{"$f":"IFERROR(('Fertilizer Plan (Alfalfa-Grass)'!E14*VLOOKUP(B36,Micronutrients,14,FALSE))/VLOOKUP(B36,Micronutrients,16,FALSE)*$F$3,0)","v":0},{"$f":"VLOOKUP(B36,Micronutrients,17,FALSE)","v":{"$error":"#REF!"}},null,null,null,null,null,"",null,null,null,""]
[null,{"$f":"'Fertilizer Plan (Alfalfa-Grass)'!A15","v":"None"},{"$f":"IFERROR(('Fertilizer Plan (Alfalfa-Grass)'!E15*VLOOKUP(B37,Micronutrients,14,FALSE))/VLOOKUP(B37,Micronutrients,16,FALSE)*$F$3,0)","v":0},{"$f":"VLOOKUP(B37,Micronutrients,17,FALSE)","v":{"$error":"#REF!"}},null,null,null,null,null,"",null,null,null,""]
[null,{"$f":"'Fertilizer Plan (Alfalfa-Grass)'!A16","v":"None"},{"$f":"IFERROR(('Fertilizer Plan (Alfalfa-Grass)'!E16*VLOOKUP(B38,Micronutrients,14,FALSE))/VLOOKUP(B38,Micronutrients,16,FALSE)*$F$3,0)","v":0},{"$error":"#REF!"},null,null,null,null,null,"",null,null,null,""]
[null,{"$f":"'Fertilizer Plan (Alfalfa-Grass)'!A17","v":"None"},{"$f":"IFERROR(('Fertilizer Plan (Alfalfa-Grass)'!E17*VLOOKUP(B39,Micronutrients,14,FALSE))/VLOOKUP(B39,Micronutrients,16,FALSE)*$F$3,0)","v":0},{"$error":"#REF!"},null,null,null,null,null,"",null,null,null,""]
[null,{"$f":"'Fertilizer Plan (Alfalfa-Grass)'!A38","v":"None"},{"$f":"IFERROR(('Fertilizer Plan (Alfalfa-Grass)'!E38*VLOOKUP(B40,Micronutrients,14,FALSE))/VLOOKUP(B40,Micronutrients,16,FALSE)*$F$3,0)","v":0},{"$error":"#REF!"},null,null,null,null,null,"",null,null,null,""]
[null,{"$f":"'Fertilizer Plan (Alfalfa-Grass)'!A39","v":"None"},{"$f":"IFERROR(('Fertilizer Plan (Alfalfa-Grass)'!E39*VLOOKUP(B41,Micronutrients,14,FALSE))/VLOOKUP(B41,Micronutrients,16,FALSE)*$F$3,0)","v":0},{"$f":"VLOOKUP(B41,Micronutrients,17,FALSE)","v":{"$error":"#REF!"}},null,null,null,null,null,"",null,null,null,""]
[null,{"$f":"'Fertilizer Plan (Alfalfa-Grass)'!A40","v":"None"},{"$f":"IFERROR(('Fertilizer Plan (Alfalfa-Grass)'!E40*VLOOKUP(B42,Micronutrients,14,FALSE))/VLOOKUP(B42,Micronutrients,16,FALSE)*$F$3,0)","v":0},{"$error":"#REF!"},null,null,null,null,null,"",null,null,null,""]
[null,{"$f":"'Fertilizer Plan (Alfalfa-Grass)'!A41","v":"None"},{"$f":"IFERROR(('Fertilizer Plan (Alfalfa-Grass)'!E41*VLOOKUP(B43,Micronutrients,14,FALSE))/VLOOKUP(B43,Micronutrients,16,FALSE)*$F$3,0)","v":0},{"$error":"#REF!"},null,null,null,null,null,"",null,null,null,""]
[null,{"$f":"'Fertilizer Plan (Alfalfa-Grass)'!A59","v":"None"},{"$f":"IFERROR(('Fertilizer Plan (Alfalfa-Grass)'!E59*VLOOKUP(B44,Micronutrients,14,FALSE))/VLOOKUP(B44,Micronutrients,16,FALSE)*$F$3,0)","v":0},{"$error":"#REF!"},null,null,null,null,null,"",null,null,null,""]
[null,{"$f":"'Fertilizer Plan (Alfalfa-Grass)'!A60","v":"None"},{"$f":"IFERROR(('Fertilizer Plan (Alfalfa-Grass)'!E60*VLOOKUP(B45,Micronutrients,14,FALSE))/VLOOKUP(B45,Micronutrients,16,FALSE)*$F$3,0)","v":0},{"$f":"VLOOKUP(B45,Micronutrients,17,FALSE)","v":{"$error":"#REF!"}},null,null,null,null,null,"",null,null,null,""]
[null,{"$f":"'Fertilizer Plan (Alfalfa-Grass)'!A61","v":"None"},{"$f":"IFERROR(('Fertilizer Plan (Alfalfa-Grass)'!E61*VLOOKUP(B46,Micronutrients,14,FALSE))/VLOOKUP(B46,Micronutrients,16,FALSE)*$F$3,0)","v":0},{"$error":"#REF!"},null,null,null,null,null,"",null,null,null,""]
[null,{"$f":"'Fertilizer Plan (Alfalfa-Grass)'!A62","v":"None"},{"$f":"IFERROR(('Fertilizer Plan (Alfalfa-Grass)'!E62*VLOOKUP(B47,Micronutrients,14,FALSE))/VLOOKUP(B47,Micronutrients,16,FALSE)*$F$3,0)","v":0},{"$error":"#REF!"},null,null,null,null,null,"",null,null,null,""]
[null,{"$f":"'Fertilizer Plan (Alfalfa-Grass)'!A80","v":"None"},{"$f":"IFERROR(('Fertilizer Plan (Alfalfa-Grass)'!E80*VLOOKUP(B48,Micronutrients,14,FALSE))/VLOOKUP(B48,Micronutrients,16,FALSE)*$F$3,0)","v":0},{"$error":"#REF!"},null,null,null,null,null,"",null,null,null,""]
[null,{"$f":"'Fertilizer Plan (Alfalfa-Grass)'!A81","v":"None"},{"$f":"IFERROR(('Fertilizer Plan (Alfalfa-Grass)'!E81*VLOOKUP(B49,Micronutrients,14,FALSE))/VLOOKUP(B49,Micronutrients,16,FALSE)*$F$3,0)","v":0},{"$f":"VLOOKUP(B49,Micronutrients,17,FALSE)","v":{"$error":"#REF!"}},null,null,null,null,null,"",null,null,null,""]
[null,{"$f":"'Fertilizer Plan (Alfalfa-Grass)'!A82","v":"None"},{"$f":"IFERROR(('Fertilizer Plan (Alfalfa-Grass)'!E82*VLOOKUP(B50,Micronutrients,14,FALSE))/VLOOKUP(B50,Micronutrients,16,FALSE)*$F$3,0)","v":0},{"$error":"#REF!"},null,null,null,null,null,"",null,null,null,""]
[null,{"$f":"'Fertilizer Plan (Alfalfa-Grass)'!A83","v":"None"},{"$f":"IFERROR(('Fertilizer Plan (Alfalfa-Grass)'!E83*VLOOKUP(B51,Micronutrients,14,FALSE))/VLOOKUP(B51,Micronutrients,16,FALSE)*$F$3,0)","v":0},{"$error":"#REF!"},null,null,null,null,null,"",null,null,null,""]
[null,{"$f":"'Fertilizer Plan (Alfalfa-Grass)'!A101","v":"None"},{"$f":"IFERROR(('Fertilizer Plan (Alfalfa-Grass)'!E101*VLOOKUP(B52,Micronutrients,14,FALSE))/VLOOKUP(B52,Micronutrients,16,FALSE)*$F$3,0)","v":0},{"$error":"#REF!"},null,null,null,null,null,"",null,null,null,""]
[null,{"$f":"'Fertilizer Plan (Alfalfa-Grass)'!A102","v":"None"},{"$f":"IFERROR(('Fertilizer Plan (Alfalfa-Grass)'!E102*VLOOKUP(B53,Micronutrients,14,FALSE))/VLOOKUP(B53,Micronutrients,16,FALSE)*$F$3,0)","v":0},{"$f":"VLOOKUP(B53,Micronutrients,17,FALSE)","v":{"$error":"#REF!"}},null,null,null,null,null,"",null,null,null,""]
[null,{"$f":"'Fertilizer Plan (Alfalfa-Grass)'!A103","v":"None"},{"$f":"IFERROR(('Fertilizer Plan (Alfalfa-Grass)'!E103*VLOOKUP(B54,Micronutrients,14,FALSE))/VLOOKUP(B54,Micronutrients,16,FALSE)*$F$3,0)","v":0},{"$error":"#REF!"},null,null,null,null,null,"",null,null,null,""]
[null,{"$f":"'Fertilizer Plan (Alfalfa-Grass)'!A104","v":"None"},{"$f":"IFERROR(('Fertilizer Plan (Alfalfa-Grass)'!E20*VLOOKUP(B58,Lime,14,FALSE))/VLOOKUP(B58,Lime,16,FALSE)*$F$3,0)","v":0},{"$error":"#REF!"},null,null,null,null,null,"",null,null,null,""]
[null,null,null,null,null,null,null,null,null,"",null,null,null,""]
[null,"Fertilizer Product (Lime)","Purchase Quantity","Product Unit",null,null,null,null,null,"",null,null,null,""]
[null,{"$f":"'Fertilizer Plan (Alfalfa-Grass)'!A20","v":"None"},{"$f":"IFERROR(('Fertilizer Plan (Alfalfa)'!E20*VLOOKUP(B58,Lime,14,FALSE))/VLOOKUP(B58,Lime,16,FALSE)*$F$3,0)","v":0},{"$f":"VLOOKUP(B58,Lime,17,FALSE)","v":"None"},null,null,null,null,null,"",null,null,null,""]
[null,null,null,null,null,null,null,null,null,"",null,null,null,""]
[null,null,null,null,null,null,null,null,null,"",null,null,null,""]
[null,null,null,null,null,null,null,null,null,"",null,null,null,""]
[null,null,null,null,null,null,null,null,null,"",null,null,null,""]
[null,null,null,null,null,null,null,null,null,"",null,null,null,""]
[null,null,null,null,null,null,null,null,null,"",null,null,null,""]
[null,null,null,null,null,null,null,null,null,"",null,null,null,""]
[null,null,null,null,null,null,null,null,null,"",null,null,null,""]
[null,null,null,null,null,null,null,null,null,"",null,null,null,""]
[null,null,null,null,null,null,null,null,null,"",null,null,null,""]
[null,null,null,null,null,null,null,null,null,"",null,null,null,""]
[null,null,null,null,null,null,null,null,null,"",null,null,null,""]
[null,null,null,null,null,null,null,null,null,"",null,null,null,""]
[null,null,null,null,null,null,null,null,null,"",null,null,null,""]
[null,null,null,null,null,null,null,null,null,"",null,null,null,""]
[null,null,null,null,null,null,null,null,null,{"$f":"IFERROR(VLOOKUP(H74,Macronutrients,17,FALSE),\"\")","v":""},null,null,null,{"$f":"IFERROR(VLOOKUP(L74,Micronutrients,17,FALSE),\"\")","v":""}]
[null,null,null,null,null,null,null,null,null,"",null,null,null,""]
[null,null,null,null,null,null,null,null,null,"",null,null,null,""]
[null,null,null,null,null,null,null,null,null,"",null,null,null,""]
[null,null,null,null,null,null,null,null,null,"",null,null,null,""]
[null,null,null,null,null,null,null,null,null,"",null,null,null,""]
[null,null,null,null,null,null,null,null,null,"",null,null,null,""]
[null,null,null,null,null,null,null,null,null,"",null,null,null,""]
[null,null,null,null,null,null,null,null,null,"",null,null,null,""]
[null,null,null,null,null,null,null,null,null,"",null,null,null,""]
[null,null,null,null,null,null,null,null,null,"",null,null,null,""]
[null,null,null,null,null,null,null,null,null,"",null,null,null,""]
[null,null,null,null,null,null,null,null,null,"",null,null,null,""]
[null,null,null,null,null,null,null,null,null,"",null,null,null,""]
[null,null,null,null,null,null,null,null,null,"",null,null,null,""]
[null,null,null,null,null,null,null,null,null,"",null,null,null,""]
[null,null,null,null,null,null,null,null,null,"",null,null,null,""]
[null,null,null,null,null,null,null,null,null,"",null,null,null,""]
[null,null,null,null,null,null,null,null,null,"",null,null,null,""]
[null,null,null,null,null,null,null,null,null,"",null,null,null,""]
[null,null,null,null,null,null,null,null,null,"",null,null,null,""]
[null,null,null,null,null,null,null,null,null,"",null,null,null,""]
[null,null,null,null,null,null,null,null,null,"",null,null,null,""]
[null,null,null,null,null,null,null,null,null,"",null,null,null,""]
[null,null,null,null,null,null,null,null,null,"",null,null,null,""]
[null,null,null,null,null,null,null,null,null,"",null,null,null,""]
[null,null,null,null,null,null,null,null,null,"",null,null,null,""]
[null,null,null,null,null,null,null,null,null,"",null,null,null,""]
[null,null,null,null,null,null,null,null,null,"",null,null,null,""]
[null,null,null,null,null,null,null,null,null,"",null,null,null,""]
[null,null,null,null,null,null,null,null,null,"",null,null,null,""]
[null,null,null,null,null,null,null,null,null,"",null,null,null,""]
[null,null,null,null,null,null,null,null,null,"",null,null,null,""]
[null,null,null,null,null,null,null,null,null,"",null,null,null,""]
[null,null,null,null,null,null,null,null,null,"",null,null,null,""]
[null,null,null,null,null,null,null,null,null,"",null,null,null,""]
[null,null,null,null,null,null,null,null,null,"",null,null,null,""]
[null,null,null,null,null,null,null,null,null,"",null,null,null,""]
[null,null,null,null,null,null,null,null,null,"",null,null,null,""]
[null,null,null,null,null,null,null,null,null,"",null,null,null,""]
[null,null,null,null,null,null,null,null,null,"",null,null,null,""]
[null,null,null,null,null,null,null,null,null,"",null,null,null,""]
[null,null,null,null,null,null,null,null,null,"",null,null,null,""]
[null,null,null,null,null,null,null,null,null,"",null,null,null,""]
[null,null,null,null,null,null,null,null,null,"",null,null,null,""]
[null,null,null,null,null,null,null,null,null,"",null,null,null,""]
[null,null,null,null,null,null,null,null,null,"",null,null,null,""]
[null,null,null,null,null,null,null,null,null,"",null,null,null,""]
[null,null,null,null,null,null,null,null,null,"",null,null,null,""]
[null,null,null,null,null,null,null,null,null,"",null,null,null,""]
[null,null,null,null,null,null,null,null,null,"",null,null,null,""]
[null,null,null,null,null,null,null,null,null,"",null,null,null,""]
[null,null,null,null,null,null,null,null,null,"",null,null,null,""]
[null,null,null,null,null,null,null,null,null,"",null,null,null,""]
[null,null,null,null,null,null,null,null,null,"",null,null,null,""]
[null,null,null,null,null,null,null,null,null,"",null,null,null,""]
[null,null,null,null,null,null,null,null,null,"",null,null,null,""]
[null,null,null,null,null,null,null,null,null,"",null,null,null,""]
[null,null,null,null,null,null,null,null,null,"",null,null,null,""]
[null,null,null,null,null,null,null,null,null,"",null,null,null,""]
[null,null,null,null,null,null,null,null,null,"",null,null,null,""]
[null,null,null,null,null,null,null,null,null,"",null,null,null,""]
[null,null,null,null,null,null,null,null,null,"",null,null,null,""]
[null,null,null,null,null,null,null,null,null,"",null,null,null,""]
[null,null,null,null,null,null,null,null,null,{"$f":"IFERROR(VLOOKUP(H138,Macronutrients,17,FALSE),\"\")","v":""},null,null,null,{"$f":"IFERROR(VLOOKUP(L138,Micronutrients,17,FALSE),\"\")","v":""}]
[null,null,null,null,null,null,null,null,null,"",null,null,null,""]
[null,null,null,null,null,null,null,null,null,"",null,null,null,""]
[null,null,null,null,null,null,null,null,null,"",null,null,null,""]
[null,null,null,null,null,null,null,null,null,"",null,null,null,""]
[null,null,null,null,null,null,null,null,null,"",null,null,null,""]
[null,null,null,null,null,null,null,null,null,"",null,null,null,""]
[null,null,null,null,null,null,null,null,null,"",null,null,null,""]
[null,null,null,null,null,null,null,null,null,"",null,null,null,""]
[null,null,null,null,null,null,null,null,null,"",null,null,null,""]
[null,null,null,null,null,null,null,null,null,"",null,null,null,""]

{"sheet":"Product Purchase List (Grass)","index":12,"n_rows":148,"n_cols":14,"rows_kept":148,"cut":false,"hidden":false,"merged":[[0,1,0,3],[0,7,0,13]]}
[null,"Product Purchase List (Grass)",null,null,null,"(Enter Below)",null,"Fertilizer Product Purchase List (Grass)"]
[null,null,null,null,null,"Acres"]
[null,"Fertilizer Product (Macronutrients)","Purchase Quantity","Product Unit",null,100,null,"Macronutrients","Purchase Quantity","Product Unit",null,"Lime","Purchase Quantity","Product Unit"]
[null,{"$f":"'Fertilizer Plan (Grass)'!A6","v":"None"},{"$f":"IFERROR(('Fertilizer Plan (Grass)'!E6*VLOOKUP(B4,Macronutrients,14,FALSE))/VLOOKUP(B4,Macronutrients,16,FALSE)*$F$3,0)","v":0},{"$f":"VLOOKUP(B4,Macronutrients,17,FALSE)","v":{"$error":"#REF!"}},null,null,null,{"$f":"_xlfn._xlws.SORT(_xlfn.LET(_xlpm.a,B4:B21,_xlpm.b,C4:C21,_xlfn.HSTACK(_xlfn.UNIQUE(_xlpm.a),SUMIFS(_xlpm.b,_xlpm.a,_xlfn.UNIQUE(_xlpm.a)))))","v":"None"},0,{"$f":"IFERROR(VLOOKUP(H4,Macronutrients,17,FALSE),\"\")","v":""},null,{"$f":"_xlfn.LET(_xlpm.a,B58,_xlpm.b,C58,_xlfn.HSTACK(_xlfn.UNIQUE(_xlpm.a),SUMIFS(_xlpm.b,_xlpm.a,_xlfn.UNIQUE(_xlpm.a))))","v":"None"},0,{"$f":"IFERROR(VLOOKUP(L4,Lime,17,FALSE),\"\")","v":""}]
[null,{"$f":"'Fertilizer Plan (Grass)'!A7","v":"None"},{"$f":"IFERROR(('Fertilizer Plan (Grass)'!E7*VLOOKUP(B5,Macronutrients,14,FALSE))/VLOOKUP(B5,Macronutrients,16,FALSE)*$F$3,0)","v":0},{"$f":"VLOOKUP(B5,Macronutrients,17,FALSE)","v":{"$error":"#REF!"}},null,null,null,null,null,{"$f":"IFERROR(VLOOKUP(H5,Macronutrients,17,FALSE),\"\")","v":""}]
[null,{"$f":"'Fertilizer Plan (Grass)'!A8","v":"None"},{"$f":"IFERROR(('Fertilizer Plan (Grass)'!E8*VLOOKUP(B6,Macronutrients,14,FALSE))/VLOOKUP(B6,Macronutrients,16,FALSE)*$F$3,0)","v":0},{"$error":"#REF!"},null,null,null,null,null,"",null,"Micronutrients","Purchase Quantity","Product Unit"]
[null,{"$f":"'Fertilizer Plan (Grass)'!A9","v":"None"},{"$f":"IFERROR(('Fertilizer Plan (Grass)'!E9*VLOOKUP(B7,Macronutrients,14,FALSE))/VLOOKUP(B7,Macronutrients,16,FALSE)*$F$3,0)","v":0},{"$error":"#REF!"},null,null,null,null,null,"",null,{"$f":"_xlfn._xlws.SORT(_xlfn.LET(_xlpm.a,B36:B47,_xlpm.b,C36:C47,_xlfn.HSTACK(_xlfn.UNIQUE(_xlpm.a),SUMIFS(_xlpm.b,_xlpm.a,_xlfn.UNIQUE(_xlpm.a)))))","v":"None"},0,{"$f":"IFERROR(VLOOKUP(L7,Micronutrients,17,FALSE),\"\")","v":""}]
[null,{"$f":"'Fertilizer Plan (Grass)'!A10","v":"None"},{"$f":"IFERROR(('Fertilizer Plan (Grass)'!E10*VLOOKUP(B8,Macronutrients,14,FALSE))/VLOOKUP(B8,Macronutrients,16,FALSE)*$F$3,0)","v":0},{"$f":"VLOOKUP(B8,Macronutrients,17,FALSE)","v":{"$error":"#REF!"}},null,null,null,null,null,{"$f":"IFERROR(VLOOKUP(H8,Macronutrients,17,FALSE),\"\")","v":""},null,null,null,""]
[null,{"$f":"'Fertilizer Plan (Grass)'!A11","v":"None"},{"$f":"IFERROR(('Fertilizer Plan (Grass)'!E11*VLOOKUP(B9,Macronutrients,14,FALSE))/VLOOKUP(B9,Macronutrients,16,FALSE)*$F$3,0)","v":0},{"$error":"#REF!"},null,null,null,null,null,"",null,null,null,""]
[null,{"$f":"'Fertilizer Plan (Grass)'!A30","v":"None"},{"$f":"IFERROR(('Fertilizer Plan (Grass)'!E30*VLOOKUP(B10,Macronutrients,14,FALSE))/VLOOKUP(10,Macronutrients,16,FALSE)*$F$3,0)","v":0},{"$error":"#REF!"},null,null,null,null,null,"",null,null,null,""]
[null,{"$f":"'Fertilizer Plan (Grass)'!A31","v":"None"},{"$f":"IFERROR(('Fertilizer Plan (Grass)'!E31*VLOOKUP(B11,Macronutrients,14,FALSE))/VLOOKUP(B11,Macronutrients,16,FALSE)*$F$3,0)","v":0},{"$error":"#REF!"},null,null,null,null,null,"",null,null,null,""]
[null,{"$f":"'Fertilizer Plan (Grass)'!A32","v":"None"},{"$f":"IFERROR(('Fertilizer Plan (Grass)'!E32*VLOOKUP(B12,Macronutrients,14,FALSE))/VLOOKUP(B12,Macronutrients,16,FALSE)*$F$3,0)","v":0},{"$error":"#REF!"},null,null,null,null,null,"",null,null,null,""]
[null,{"$f":"'Fertilizer Plan (Grass)'!A33","v":"None"},{"$f":"IFERROR(('Fertilizer Plan (Grass)'!E33*VLOOKUP(B13,Macronutrients,14,FALSE))/VLOOKUP(B13,Macronutrients,16,FALSE)*$F$3,0)","v":0},{"$error":"#REF!"},null,null,null,null,null,"",null,null,null,""]
[null,{"$f":"'Fertilizer Plan (Grass)'!A34","v":"None"},{"$f":"IFERROR(('Fertilizer Plan (Grass)'!E34*VLOOKUP(B14,Macronutrients,14,FALSE))/VLOOKUP(B14,Macronutrients,16,FALSE)*$F$3,0)","v":0},{"$error":"#REF!"},null,null,null,null,null,"",null,null,null,""]
[null,{"$f":"'Fertilizer Plan (Grass)'!A35","v":"None"},{"$f":"IFERROR(('Fertilizer Plan (Grass)'!E35*VLOOKUP(B15,Macronutrients,14,FALSE))/VLOOKUP(B15,Macronutrients,16,FALSE)*$F$3,0)","v":0},{"$error":"#REF!"},null,null,null,null,null,"",null,null,null,""]
[null,{"$f":"'Fertilizer Plan (Grass)'!A51","v":"None"},{"$f":"IFERROR(('Fertilizer Plan (Grass)'!E51*VLOOKUP(B16,Macronutrients,14,FALSE))/VLOOKUP(B16,Macronutrients,16,FALSE)*$F$3,0)","v":0},{"$error":"#REF!"},null,null,null,null,null,"",null,null,null,""]
[null,{"$f":"'Fertilizer Plan (Grass)'!A52","v":"None"},{"$f":"IFERROR(('Fertilizer Plan (Grass)'!E52*VLOOKUP(B17,Macronutrients,14,FALSE))/VLOOKUP(B17,Macronutrients,16,FALSE)*$F$3,0)","v":0},{"$error":"#REF!"},null,null,null,null,null,"",null,null,null,""]
[null,{"$f":"'Fertilizer Plan (Grass)'!A53","v":"None"},{"$f":"IFERROR(('Fertilizer Plan (Grass)'!E53*VLOOKUP(B18,Macronutrients,14,FALSE))/VLOOKUP(B18,Macronutrients,16,FALSE)*$F$3,0)","v":0},{"$error":"#REF!"},null,null,null,null,null,"",null,null,null,""]
[null,{"$f":"'Fertilizer Plan (Grass)'!A54","v":"None"},{"$f":"IFERROR(('Fertilizer Plan (Grass)'!E54*VLOOKUP(B19,Macronutrients,14,FALSE))/VLOOKUP(B19,Macronutrients,16,FALSE)*$F$3,0)","v":0},{"$error":"#REF!"},null,null,null,null,null,"",null,null,null,""]
[null,{"$f":"'Fertilizer Plan (Grass)'!A55","v":"None"},{"$f":"IFERROR(('Fertilizer Plan (Grass)'!E55*VLOOKUP(B20,Macronutrients,14,FALSE))/VLOOKUP(B20,Macronutrients,16,FALSE)*$F$3,0)","v":0},{"$error":"#REF!"},null,null,null,null,null,"",null,null,null,""]
[null,{"$f":"'Fertilizer Plan (Grass)'!A56","v":"None"},{"$f":"IFERROR(('Fertilizer Plan (Grass)'!E56*VLOOKUP(B21,Macronutrients,14,FALSE))/VLOOKUP(B21,Macronutrients,16,FALSE)*$F$3,0)","v":0},{"$error":"#REF!"},null,null,null,null,null,"",null,null,null,""]
[null,{"$f":"'Fertilizer Plan (Grass)'!A72","v":"None"},{"$f":"IFERROR(('Fertilizer Plan (Grass)'!E72*VLOOKUP(B22,Macronutrients,14,FALSE))/VLOOKUP(B22,Macronutrients,16,FALSE)*$F$3,0)","v":0},{"$error":"#REF!"},null,null,null,null,null,"",null,null,null,""]
[null,{"$f":"'Fertilizer Plan (Grass)'!A73","v":"None"},{"$f":"IFERROR(('Fertilizer Plan (Grass)'!E73*VLOOKUP(B23,Macronutrients,14,FALSE))/VLOOKUP(B23,Macronutrients,16,FALSE)*$F$3,0)","v":0},{"$error":"#REF!"},null,null,null,null,null,"",null,null,null,""]
[null,{"$f":"'Fertilizer Plan (Grass)'!A74","v":"None"},{"$f":"IFERROR(('Fertilizer Plan (Grass)'!E74*VLOOKUP(B24,Macronutrients,14,FALSE))/VLOOKUP(B24,Macronutrients,16,FALSE)*$F$3,0)","v":0},{"$error":"#REF!"},null,null,null,null,null,"",null,null,null,""]
[null,{"$f":"'Fertilizer Plan (Grass)'!A75","v":"None"},{"$f":"IFERROR(('Fertilizer Plan (Grass)'!E75*VLOOKUP(B25,Macronutrients,14,FALSE))/VLOOKUP(B25,Macronutrients,16,FALSE)*$F$3,0)","v":0},{"$error":"#REF!"},null,null,null,null,null,"",null,null,null,""]
[null,{"$f":"'Fertilizer Plan (Grass)'!A76","v":"None"},{"$f":"IFERROR(('Fertilizer Plan (Grass)'!E76*VLOOKUP(B26,Macronutrients,14,FALSE))/VLOOKUP(B26,Macronutrients,16,FALSE)*$F$3,0)","v":0},{"$error":"#REF!"},null,null,null,null,null,"",null,null,null,""]
[null,{"$f":"'Fertilizer Plan (Grass)'!A77","v":"None"},{"$f":"IFERROR(('Fertilizer Plan (Grass)'!E77*VLOOKUP(B27,Macronutrients,14,FALSE))/VLOOKUP(B27,Macronutrients,16,FALSE)*$F$3,0)","v":0},{"$error":"#REF!"},null,null,null,null,null,"",null,null,null,""]
[null,{"$f":"'Fertilizer Plan (Grass)'!A93","v":"None"},{"$f":"IFERROR(('Fertilizer Plan (Grass)'!E93*VLOOKUP(B28,Macronutrients,14,FALSE))/VLOOKUP(B28,Macronutrients,16,FALSE)*$F$3,0)","v":0},{"$error":"#REF!"},null,null,null,null,null,"",null,null,null,{"$f":"IFERROR(VLOOKUP(L28,Micronutrients,17,FALSE),\"\")","v":""}]
[null,{"$f":"'Fertilizer Plan (Grass)'!A94","v":"None"},{"$f":"IFERROR(('Fertilizer Plan (Grass)'!E94*VLOOKUP(B29,Macronutrients,14,FALSE))/VLOOKUP(B29,Macronutrients,16,FALSE)*$F$3,0)","v":0},{"$error":"#REF!"},null,null,null,null,null,"",null,null,null,""]
[null,{"$f":"'Fertilizer Plan (Grass)'!A95","v":"None"},{"$f":"IFERROR(('Fertilizer Plan (Grass)'!E95*VLOOKUP(B30,Macronutrients,14,FALSE))/VLOOKUP(B30,Macronutrients,16,FALSE)*$F$3,0)","v":0},{"$error":"#REF!"},null,null,null,null,null,"",null,null,null,""]
[null,{"$f":"'Fertilizer Plan (Grass)'!A96","v":"None"},{"$f":"IFERROR(('Fertilizer Plan (Grass)'!E96*VLOOKUP(B31,Macronutrients,14,FALSE))/VLOOKUP(B31,Macronutrients,16,FALSE)*$F$3,0)","v":0},{"$error":"#REF!"},null,null,null,null,null,"",null,null,null,""]
[null,{"$f":"'Fertilizer Plan (Grass)'!A97","v":"None"},{"$f":"IFERROR(('Fertilizer Plan (Grass)'!E97*VLOOKUP(B32,Macronutrients,14,FALSE))/VLOOKUP(B32,Macronutrients,16,FALSE)*$F$3,0)","v":0},{"$error":"#REF!"},null,null,null,null,null,"",null,null,null,""]
[null,{"$f":"'Fertilizer Plan (Grass)'!A98","v":"None"},{"$f":"IFERROR(('Fertilizer Plan (Grass)'!E98*VLOOKUP(B33,Macronutrients,14,FALSE))/VLOOKUP(B33,Macronutrients,16,FALSE)*$F$3,0)","v":0},{"$error":"#REF!"},null,null,null,null,null,"",null,null,null,""]
[null,null,null,null,null,null,null,null,null,"",null,null,null,""]
[null,"Fertilizer Product (Micronutrients)","Purchase Quantity","Product Unit",null,null,null,null,null,{"$f":"IFERROR(VLOOKUP(H35,Macronutrients,17,FALSE),\"\")","v":""},null,null,null,""]
[null,{"$f":"'Fertilizer Plan (Grass)'!A14","v":"None"},{"$f":"IFERROR(('Fertilizer Plan (Grass)'!E14*VLOOKUP(B36,Micronutrients,14,FALSE))/VLOOKUP(B36,Micronutrients,16,FALSE)*$F$3,0)","v":0},{"$f":"VLOOKUP(B36,Micronutrients,17,FALSE)","v":{"$error":"#REF!"}},null,null,null,null,null,"",null,null,null,""]
[null,{"$f":"'Fertilizer Plan (Grass)'!A15","v":"None"},{"$f":"IFERROR(('Fertilizer Plan (Grass)'!E15*VLOOKUP(B37,Micronutrients,14,FALSE))/VLOOKUP(B37,Micronutrients,16,FALSE)*$F$3,0)","v":0},{"$f":"VLOOKUP(B37,Micronutrients,17,FALSE)","v":{"$error":"#REF!"}},null,null,null,null,null,"",null,null,null,""]
[null,{"$f":"'Fertilizer Plan (Grass)'!A16","v":"None"},{"$f":"IFERROR(('Fertilizer Plan (Grass)'!E16*VLOOKUP(B38,Micronutrients,14,FALSE))/VLOOKUP(B38,Micronutrients,16,FALSE)*$F$3,0)","v":0},{"$error":"#REF!"},null,null,null,null,null,"",null,null,null,""]
[null,{"$f":"'Fertilizer Plan (Grass)'!A17","v":"None"},{"$f":"IFERROR(('Fertilizer Plan (Grass)'!E17*VLOOKUP(B39,Micronutrients,14,FALSE))/VLOOKUP(B39,Micronutrients,16,FALSE)*$F$3,0)","v":0},{"$error":"#REF!"},null,null,null,null,null,"",null,null,null,""]
[null,{"$f":"'Fertilizer Plan (Grass)'!A38","v":"None"},{"$f":"IFERROR(('Fertilizer Plan (Grass)'!E38*VLOOKUP(B40,Micronutrients,14,FALSE))/VLOOKUP(B40,Micronutrients,16,FALSE)*$F$3,0)","v":0},{"$error":"#REF!"},null,null,null,null,null,"",null,null,null,""]
[null,{"$f":"'Fertilizer Plan (Grass)'!A39","v":"None"},{"$f":"IFERROR(('Fertilizer Plan (Grass)'!E39*VLOOKUP(B41,Micronutrients,14,FALSE))/VLOOKUP(B41,Micronutrients,16,FALSE)*$F$3,0)","v":0},{"$f":"VLOOKUP(B41,Micronutrients,17,FALSE)","v":{"$error":"#REF!"}},null,null,null,null,null,"",null,null,null,""]
[null,{"$f":"'Fertilizer Plan (Grass)'!A40","v":"None"},{"$f":"IFERROR(('Fertilizer Plan (Grass)'!E40*VLOOKUP(B42,Micronutrients,14,FALSE))/VLOOKUP(B42,Micronutrients,16,FALSE)*$F$3,0)","v":0},{"$error":"#REF!"},null,null,null,null,null,"",null,null,null,""]
[null,{"$f":"'Fertilizer Plan (Grass)'!A41","v":"None"},{"$f":"IFERROR(('Fertilizer Plan (Grass)'!E41*VLOOKUP(B43,Micronutrients,14,FALSE))/VLOOKUP(B43,Micronutrients,16,FALSE)*$F$3,0)","v":0},{"$error":"#REF!"},null,null,null,null,null,"",null,null,null,""]
[null,{"$f":"'Fertilizer Plan (Grass)'!A59","v":"None"},{"$f":"IFERROR(('Fertilizer Plan (Grass)'!E59*VLOOKUP(B44,Micronutrients,14,FALSE))/VLOOKUP(B44,Micronutrients,16,FALSE)*$F$3,0)","v":0},{"$error":"#REF!"},null,null,null,null,null,"",null,null,null,""]
[null,{"$f":"'Fertilizer Plan (Grass)'!A60","v":"None"},{"$f":"IFERROR(('Fertilizer Plan (Grass)'!E60*VLOOKUP(B45,Micronutrients,14,FALSE))/VLOOKUP(B45,Micronutrients,16,FALSE)*$F$3,0)","v":0},{"$f":"VLOOKUP(B45,Micronutrients,17,FALSE)","v":{"$error":"#REF!"}},null,null,null,null,null,"",null,null,null,""]
[null,{"$f":"'Fertilizer Plan (Grass)'!A61","v":"None"},{"$f":"IFERROR(('Fertilizer Plan (Grass)'!E61*VLOOKUP(B46,Micronutrients,14,FALSE))/VLOOKUP(B46,Micronutrients,16,FALSE)*$F$3,0)","v":0},{"$error":"#REF!"},null,null,null,null,null,"",null,null,null,""]
[null,{"$f":"'Fertilizer Plan (Grass)'!A62","v":"None"},{"$f":"IFERROR(('Fertilizer Plan (Grass)'!E62*VLOOKUP(B47,Micronutrients,14,FALSE))/VLOOKUP(B47,Micronutrients,16,FALSE)*$F$3,0)","v":0},{"$error":"#REF!"},null,null,null,null,null,"",null,null,null,""]
[null,{"$f":"'Fertilizer Plan (Grass)'!A80","v":"None"},{"$f":"IFERROR(('Fertilizer Plan (Grass)'!E80*VLOOKUP(B48,Micronutrients,14,FALSE))/VLOOKUP(B48,Micronutrients,16,FALSE)*$F$3,0)","v":0},{"$error":"#REF!"},null,null,null,null,null,"",null,null,null,""]
[null,{"$f":"'Fertilizer Plan (Grass)'!A81","v":"None"},{"$f":"IFERROR(('Fertilizer Plan (Grass)'!E81*VLOOKUP(B49,Micronutrients,14,FALSE))/VLOOKUP(B49,Micronutrients,16,FALSE)*$F$3,0)","v":0},{"$f":"VLOOKUP(B49,Micronutrients,17,FALSE)","v":{"$error":"#REF!"}},null,null,null,null,null,"",null,null,null,""]
[null,{"$f":"'Fertilizer Plan (Grass)'!A82","v":"None"},{"$f":"IFERROR(('Fertilizer Plan (Grass)'!E82*VLOOKUP(B50,Micronutrients,14,FALSE))/VLOOKUP(B50,Micronutrients,16,FALSE)*$F$3,0)","v":0},{"$error":"#REF!"},null,null,null,null,null,"",null,null,null,""]
[null,{"$f":"'Fertilizer Plan (Grass)'!A83","v":"None"},{"$f":"IFERROR(('Fertilizer Plan (Grass)'!E83*VLOOKUP(B51,Micronutrients,14,FALSE))/VLOOKUP(B51,Micronutrients,16,FALSE)*$F$3,0)","v":0},{"$error":"#REF!"},null,null,null,null,null,"",null,null,null,""]
[null,{"$f":"'Fertilizer Plan (Grass)'!A101","v":"None"},{"$f":"IFERROR(('Fertilizer Plan (Grass)'!E101*VLOOKUP(B52,Micronutrients,14,FALSE))/VLOOKUP(B52,Micronutrients,16,FALSE)*$F$3,0)","v":0},{"$error":"#REF!"},null,null,null,null,null,"",null,null,null,""]
[null,{"$f":"'Fertilizer Plan (Grass)'!A102","v":"None"},{"$f":"IFERROR(('Fertilizer Plan (Grass)'!E102*VLOOKUP(B53,Micronutrients,14,FALSE))/VLOOKUP(B53,Micronutrients,16,FALSE)*$F$3,0)","v":0},{"$f":"VLOOKUP(B53,Micronutrients,17,FALSE)","v":{"$error":"#REF!"}},null,null,null,null,null,"",null,null,null,""]
[null,{"$f":"'Fertilizer Plan (Grass)'!A103","v":"None"},{"$f":"IFERROR(('Fertilizer Plan (Grass)'!E103*VLOOKUP(B54,Micronutrients,14,FALSE))/VLOOKUP(B54,Micronutrients,16,FALSE)*$F$3,0)","v":0},{"$error":"#REF!"},null,null,null,null,null,"",null,null,null,""]
[null,{"$f":"'Fertilizer Plan (Grass)'!A104","v":"None"},{"$f":"IFERROR(('Fertilizer Plan (Grass)'!E20*VLOOKUP(B58,Lime,14,FALSE))/VLOOKUP(B58,Lime,16,FALSE)*$F$3,0)","v":0},{"$error":"#REF!"},null,null,null,null,null,"",null,null,null,""]
[null,null,null,null,null,null,null,null,null,"",null,null,null,""]
[null,"Fertilizer Product (Lime)","Purchase Quantity","Product Unit",null,null,null,null,null,"",null,null,null,""]
[null,{"$f":"'Fertilizer Plan (Grass)'!A20","v":"None"},{"$f":"IFERROR(('Fertilizer Plan (Alfalfa)'!E20*VLOOKUP(B58,Lime,14,FALSE))/VLOOKUP(B58,Lime,16,FALSE)*$F$3,0)","v":0},{"$f":"VLOOKUP(B58,Lime,17,FALSE)","v":{"$error":"#REF!"}},null,null,null,null,null,"",null,null,null,""]
[null,null,null,null,null,null,null,null,null,"",null,null,null,""]
[null,null,null,null,null,null,null,null,null,"",null,null,null,""]
[null,null,null,null,null,null,null,null,null,"",null,null,null,""]
[null,null,null,null,null,null,null,null,null,"",null,null,null,""]
[null,null,null,null,null,null,null,null,null,"",null,null,null,""]
[null,null,null,null,null,null,null,null,null,"",null,null,null,""]
[null,null,null,null,null,null,null,null,null,"",null,null,null,""]
[null,null,null,null,null,null,null,null,null,"",null,null,null,""]
[null,null,null,null,null,null,null,null,null,"",null,null,null,""]
[null,null,null,null,null,null,null,null,null,"",null,null,null,""]
[null,null,null,null,null,null,null,null,null,"",null,null,null,""]
[null,null,null,null,null,null,null,null,null,"",null,null,null,""]
[null,null,null,null,null,null,null,null,null,"",null,null,null,""]
[null,null,null,null,null,null,null,null,null,"",null,null,null,""]
[null,null,null,null,null,null,null,null,null,"",null,null,null,""]
[null,null,null,null,null,null,null,null,null,{"$f":"IFERROR(VLOOKUP(H74,Macronutrients,17,FALSE),\"\")","v":""},null,null,null,{"$f":"IFERROR(VLOOKUP(L74,Micronutrients,17,FALSE),\"\")","v":""}]
[null,null,null,null,null,null,null,null,null,"",null,null,null,""]
[null,null,null,null,null,null,null,null,null,"",null,null,null,""]
[null,null,null,null,null,null,null,null,null,"",null,null,null,""]
[null,null,null,null,null,null,null,null,null,"",null,null,null,""]
[null,null,null,null,null,null,null,null,null,"",null,null,null,""]
[null,null,null,null,null,null,null,null,null,"",null,null,null,""]
[null,null,null,null,null,null,null,null,null,"",null,null,null,""]
[null,null,null,null,null,null,null,null,null,"",null,null,null,""]
[null,null,null,null,null,null,null,null,null,"",null,null,null,""]
[null,null,null,null,null,null,null,null,null,"",null,null,null,""]
[null,null,null,null,null,null,null,null,null,"",null,null,null,""]
[null,null,null,null,null,null,null,null,null,"",null,null,null,""]
[null,null,null,null,null,null,null,null,null,"",null,null,null,""]
[null,null,null,null,null,null,null,null,null,"",null,null,null,""]
[null,null,null,null,null,null,null,null,null,"",null,null,null,""]
[null,null,null,null,null,null,null,null,null,"",null,null,null,""]
[null,null,null,null,null,null,null,null,null,"",null,null,null,""]
[null,null,null,null,null,null,null,null,null,"",null,null,null,""]
[null,null,null,null,null,null,null,null,null,"",null,null,null,""]
[null,null,null,null,null,null,null,null,null,"",null,null,null,""]
[null,null,null,null,null,null,null,null,null,"",null,null,null,""]
[null,null,null,null,null,null,null,null,null,"",null,null,null,""]
[null,null,null,null,null,null,null,null,null,"",null,null,null,""]
[null,null,null,null,null,null,null,null,null,"",null,null,null,""]
[null,null,null,null,null,null,null,null,null,"",null,null,null,""]
[null,null,null,null,null,null,null,null,null,"",null,null,null,""]
[null,null,null,null,null,null,null,null,null,"",null,null,null,""]
[null,null,null,null,null,null,null,null,null,"",null,null,null,""]
[null,null,null,null,null,null,null,null,null,"",null,null,null,""]
[null,null,null,null,null,null,null,null,null,"",null,null,null,""]
[null,null,null,null,null,null,null,null,null,"",null,null,null,""]
[null,null,null,null,null,null,null,null,null,"",null,null,null,""]
[null,null,null,null,null,null,null,null,null,"",null,null,null,""]
[null,null,null,null,null,null,null,null,null,"",null,null,null,""]
[null,null,null,null,null,null,null,null,null,"",null,null,null,""]
[null,null,null,null,null,null,null,null,null,"",null,null,null,""]
[null,null,null,null,null,null,null,null,null,"",null,null,null,""]
[null,null,null,null,null,null,null,null,null,"",null,null,null,""]
[null,null,null,null,null,null,null,null,null,"",null,null,null,""]
[null,null,null,null,null,null,null,null,null,"",null,null,null,""]
[null,null,null,null,null,null,null,null,null,"",null,null,null,""]
[null,null,null,null,null,null,null,null,null,"",null,null,null,""]
[null,null,null,null,null,null,null,null,null,"",null,null,null,""]
[null,null,null,null,null,null,null,null,null,"",null,null,null,""]
[null,null,null,null,null,null,null,null,null,"",null,null,null,""]
[null,null,null,null,null,null,null,null,null,"",null,null,null,""]
[null,null,null,null,null,null,null,null,null,"",null,null,null,""]
[null,null,null,null,null,null,null,null,null,"",null,null,null,""]
[null,null,null,null,null,null,null,null,null,"",null,null,null,""]
[null,null,null,null,null,null,null,null,null,"",null,null,null,""]
[null,null,null,null,null,null,null,null,null,"",null,null,null,""]
[null,null,null,null,null,null,null,null,null,"",null,null,null,""]
[null,null,null,null,null,null,null,null,null,"",null,null,null,""]
[null,null,null,null,null,null,null,null,null,"",null,null,null,""]
[null,null,null,null,null,null,null,null,null,"",null,null,null,""]
[null,null,null,null,null,null,null,null,null,"",null,null,null,""]
[null,null,null,null,null,null,null,null,null,"",null,null,null,""]
[null,null,null,null,null,null,null,null,null,"",null,null,null,""]
[null,null,null,null,null,null,null,null,null,"",null,null,null,""]
[null,null,null,null,null,null,null,null,null,"",null,null,null,""]
[null,null,null,null,null,null,null,null,null,"",null,null,null,""]
[null,null,null,null,null,null,null,null,null,"",null,null,null,""]
[null,null,null,null,null,null,null,null,null,"",null,null,null,""]
[null,null,null,null,null,null,null,null,null,{"$f":"IFERROR(VLOOKUP(H138,Macronutrients,17,FALSE),\"\")","v":""},null,null,null,{"$f":"IFERROR(VLOOKUP(L138,Micronutrients,17,FALSE),\"\")","v":""}]
[null,null,null,null,null,null,null,null,null,"",null,null,null,""]
[null,null,null,null,null,null,null,null,null,"",null,null,null,""]
[null,null,null,null,null,null,null,null,null,"",null,null,null,""]
[null,null,null,null,null,null,null,null,null,"",null,null,null,""]
[null,null,null,null,null,null,null,null,null,"",null,null,null,""]
[null,null,null,null,null,null,null,null,null,"",null,null,null,""]
[null,null,null,null,null,null,null,null,null,"",null,null,null,""]
[null,null,null,null,null,null,null,null,null,"",null,null,null,""]
[null,null,null,null,null,null,null,null,null,"",null,null,null,""]
[null,null,null,null,null,null,null,null,null,"",null,null,null,""]

{"sheet":"Simple Fertilizer Calculator","index":13,"n_rows":46,"n_cols":11,"rows_kept":46,"cut":false,"hidden":false,"merged":[[42,1,43,6],[45,1,47,6],[27,1,28,6],[30,1,32,6],[1,1,1,6],[20,1,20,6],[35,1,35,6]]}
[]
[null,"Fertilizer Calculator"]
[null,null,"Source","Price/ton","Price/lb","Amount","Cost/Acre"]
[null,null,"(Enter Below)","(Enter Below)",null,"(Enter Below)"]
[null,"Nitrogen",0.46,533,{"$f":"D5/H5","v":0.57934782608695656},86,{"$f":"F5*E5","v":49.823913043478264},{"$f":"2000*C5","v":920}]
[null,"Nitrogen from Phosphate",0.18,144,{"$f":"D6/J20","v":0.65454545454545454},40,{"$f":"F6*E6","v":26.18181818181818},{"$f":"2000*C10","v":920}]
[null,"Nitrogen from Sulfur",0.21,168,{"$f":"D7/J35","v":0.4},40,{"$f":"F7*E7","v":16}]
[null,null,null,null,null,null,{"$f":"SUM(G5:G7)","v":92.005731225296444}]
[null,null,"(Enter Below)","(Enter Below)",null,"(Enter Below)"]
[null,"Phosphorus",0.46,361,{"$f":"D10/H6","v":0.3923913043478261},60,{"$f":"F10*E10","v":23.543478260869566},{"$f":"2000*C6","v":360}]
[null,"Potassium",0.6,355,{"$f":"D11/H11","v":0.29583333333333334},75,{"$f":"F11*E11","v":22.1875},{"$f":"2000*C11","v":1200}]
[null,"Sulfur",0.24,157,{"$f":"D12/H12","v":0.32708333333333334},60,{"$f":"F12*E12","v":19.625},{"$f":"2000*C12","v":480}]
[null,null,null,null,null,null,{"$f":"SUM(G10:G12)","v":65.355978260869563}]
[null,null,null,null,null,"Total Fertilizer",{"$f":"G8+G13","v":157.36170948616601}]
[null,"Source Code:"]
[null,"Nitrogen","28-0-0","type in",0.28000000000000003]
[null,"Phosphorus","18-46-0","type in",0.46]
[null,"Potassium","0-0-60","type in",0.6]
[]
[null,null,null,null,null,null,null,null,"lbs/ton",{"$f":"2000*(C24/100)","v":220},{"$f":"2000*(D24/100)","v":1040}]
[null,"Extract Nitrogen Cost from Phosphate Fertilizers",null,null,null,null,null,null,"%/ton",{"$f":"J20/(J20+K20)","v":0.17460317460317459},{"$f":"K20/(J20+K20)","v":0.82539682539682535}]
[null,null,"N","P","Price"]
[null,null,"(Enter Below)","(Enter Below)","(Enter Below)"]
[null,null,11,52,765]
[null,"Price/lb",0.57999999999999996,{"$f":"D26/K20","v":0.61288461538461536}]
[null,"Price/ton",{"$f":"J20*C25","v":127.6},{"$f":"E24-C26","v":637.4},{"$f":"SUM(C26:D26)","v":765}]
[]
[null,"*Enter a price/lb of nitrogen to calculate the phosphate fertilizer price.  The price as calculated above can be used if a price is not already known."]
[]
[]
[null,"*If nitrogen from Phosphate fertilizer will not be utilized by the crop, simply enter \"0\" in Amount and adjust the price of the phosphate fertilizer to the total cost/ton of the blend."]
[]
[]
[]
[null,null,null,null,null,null,null,null,"lbs/ton",{"$f":"2000*(C39/100)","v":420},{"$f":"2000*(D39/100)","v":480}]
[null,"Extract Nitrogen Cost from Sulfur Fertilizers",null,null,null,null,null,null,"%/ton",{"$f":"J35/(J35+K35)","v":0.46666666666666667},{"$f":"K35/(J35+K35)","v":0.53333333333333333}]
[null,null,"N","S","Price"]
[null,null,"(Enter Below)","(Enter Below)","(Enter Below)"]
[null,null,21,24,325]
[null,"Price/lb",0.4,{"$f":"D41/K35","v":0.32708333333333334}]
[null,"Price/ton",{"$f":"J35*C40","v":168},{"$f":"E39-C41","v":157},{"$f":"SUM(C41:D41)","v":325}]
[]
[null,"*Enter a price/lb of nitrogen to calculate the sulfur fertilizer price.  The price as calculated above can be used if a price is not already known."]
[]
[]
[null,"*If nitrogen from sulfur fertilizer will not be utilized by the crop, simply enter \"0\" in Amount and adjust the price of the sulfur fertilizer to the total cost/ton of the blend."]

{"sheet":"Tri-State Recommendations","index":14,"n_rows":31,"n_cols":12,"rows_kept":31,"cut":false,"hidden":true,"merged":[[29,1,29,14],[30,9,30,12],[15,0,17,0],[19,1,19,11],[0,1,0,11],[2,1,2,3],[2,5,2,7],[2,9,2,11],[6,1,6,11],[7,0,14,0],[0,0,3,0]]}
[null,"Tri-State Fertilizer Recommendations"]
[]
[null,"Corn",null,null,null,"Soybeans",null,null,null,"Wheat"]
[]
["Yield Goal:",{"$f":"'Nutrient Management'!C6","v":0},null,null,null,{"$f":"'Nutrient Management'!G6","v":0},null,null,null,{"$f":"'Nutrient Management'!K6","v":0}]
[]
["Soil Test Level:","Input amount of nutrients currently present in  field (based on soil test results)"]
[null,"(Enter Below)","(Enter Below)","(Enter Below)",null,"(Enter Below)","(Enter Below)","(Enter Below)",null,"(Enter Below)","(Enter Below)","(Enter Below)"]
[null,"N","P","K",null,"N","P","K",null,"N","P","K"]
[null,0,0,0,null,0,0,0,null,0,0,0]
[null,"S","Ca","Mag",null,"S","Ca","Mag",null,"S","Ca","Mag"]
[null,0,0,0,null,0,0,0,null,0,0,0]
[null,0,0,0,null,0,0,0,null,0,0,0]
[null,0,0,0,null,0,0,0,null,0,0,0]
[null,null,"(Enter Below)",null,null,null,"(Enter Below)",null,null,null,"(Enter Below)"]
["Note: CEC & pH levels needed for calculation accuracy in Soil Test Based Recommendations","CEC Level:",0,null,null,"CEC Level:",0,null,null,"CEC Level:",0]
[null,null,"(Enter Below)",null,null,null,"(Enter Below)",null,null,null,"(Enter Below)"]
[null,"pH Level:",0,null,null,"pH Level:",0,null,null,"pH Level:",0]
[]
["Soil Test Based Recommendations:","Based on soil test data, the following are tri-state recommendations for fertilizer needs to meet yield goals."]
[]
[null,"N","P","K",null,"N","P","K",null,"N","P","K"]
[null,0,{"$f":"IF(AND(C10<20,B5<=150),105,IF(AND(C10<20,B5<=200),120,IF(AND(C10<20,B5<=250),140,IF(AND(C10<20,B5<=300),155,IF(AND(C10<30,B5<=150),80,IF(AND(C10<30,B5<=200),95,IF(AND(C10<30,B5<=250),115,IF(AND(C10<30,B5<=300),130,IF(AND(C10<80,B5<=150),55,IF(AND(C10<80,B5<=200),70,IF(AND(C10<80,B5<=250),90,IF(AND(C10<80,B5<=300),105,IF(AND(C10>=80,B5<=150),0,IF(AND(C10>=80,B5<=200),0,IF(AND(C10>=80,B5<=250),0,IF(AND(C10>=80,B5<=300),0))))))))))))))))","v":105},{"$f":"IF(AND(D10<=100,B5<=150,C16<=5),95,IF(AND(D10<=100,B5<=200,C16<=5),105,IF(AND(D10<=105,B5<=250,C16<=5),115,IF(AND(D10<=100,B5<=160,C16<=5),125,IF(AND(D10<=150,B5<=150,C16<=5),60,IF(AND(D10<=150,B5<=200,C16<=5),70,IF(AND(D10<=150,B5<=250,C16<=5),80,IF(AND(D10<=150,B5<=160,C16<=5),90,IF(AND(D10<=260,B5<=150,C16<=5),30,IF(AND(D10<=260,B5<=200,C16<=5),40,IF(AND(D10<=260,B5<=250,C16<=5),50,IF(AND(D10<=260,B5<=160,C16<=5),60,IF(AND(D10>=260,B5<=150,C16<=5),0,IF(AND(D10>=260,B5<=200,C16<=5),0,IF(AND(D10>=260,B5<=250,C16<=5),0,IF(AND(D10>=260,B5<=160,C16<=5),0,IF(AND(D10<=100,B5<=150,C16>=6),155,IF(AND(D10<=100,B5<=200,C16>=6),165,IF(AND(D10<=100,B5<=250,C16>=6),175,IF(AND(D10<=100,B5<=160,C16>=6),185,IF(AND(D10<=150,B5<=150,C16>=6),110,IF(AND(D10<=150,B5<=200,C16>=6),120,IF(AND(D10<=150,B5<=250,C16>=6),130,IF(AND(D10<=150,B5<=160,C16>=6),140,IF(AND(D10<=200,B5<=150,C16>=6),65,IF(AND(D10<=200,B5<=200,C16>=6),75,IF(AND(D10<=200,B5<=250,C16>=6),85,IF(AND(D10<=200,B5<=160,C16>=6),95,IF(AND(D10<=340,B5<=150,C16>=6),30,IF(AND(D10<=340,B5<=200,C16>=6),40,IF(AND(D10<=340,B5<=250,C16>=6),50,IF(AND(D10<=340,B5<=160,C16>=6),60,IF(AND(D10>=340,B5<=150,C16>=6),0,IF(AND(D10>=340,B5<=200,C16>=6),0,IF(AND(D10>=340,B5<=250,C16>=6),0,IF(AND(D10>=340,B5<=160,C16>=6),0))))))))))))))))))))))))))))))))))))","v":95},null,0,{"$f":"IF(AND(G10<20,F5<=30),75,IF(AND(G10<20,F5<=50),90,IF(AND(G10<20,F5<=70),105,IF(AND(G10<20,F5<=90),120,IF(AND(G10<30,F5<=30),50,IF(AND(G10<30,F5<=50),65,IF(AND(G10<30,F5<=70),80,IF(AND(G10<30,F5<=90),95,IF(AND(G10<80,F5<=30),25,IF(AND(G10<80,F5<=50),40,IF(AND(G10<80,F5<=70),55,IF(AND(G10<80,F5<=90),70,IF(AND(G10>=80,F5<=30),0,IF(AND(G10>=80,F5<=50),0,IF(AND(G10>=80,F5<=70),0,IF(AND(G10>=80,F5<=90),0))))))))))))))))","v":75},{"$f":"IF(AND(H10<=100,F5<=30,G16<=5),95,IF(AND(H10<=100,F5<=50,G16<=5),120,IF(AND(H10<=100,F5<=70,G16<=5),145,IF(AND(H10<=100,F5<=90,G16<=5),165,IF(AND(H10<=150,F5<=30,G16<=5),65,IF(AND(H10<=150,F5<=50,G16<=5),90,IF(AND(H10<=150,F5<=70,G16<=5),110,IF(AND(H10<=150,F5<=90,G16<=5),135,IF(AND(H10<=260,F5<=30,G16<=5),35,IF(AND(H10<=260,F5<=50,G16<=5),60,IF(AND(H10<=260,F5<=70,G16<=5),80,IF(AND(H10<=260,F5<=90,G16<=5),105,IF(AND(H10>=260,F5<=30,G16<=5),0,IF(AND(H10>=260,F5<=50,G16<=5),0,IF(AND(H10>=260,F5<=70,G16<=5),0,IF(AND(H10>=260,F5<=90,G16<=5),0,IF(AND(H10<=100,F5<=30,G16>=6),155,IF(AND(H10<=100,F5<=50,G16>=6),180,IF(AND(H10<=100,F5<=70,G16>=6),205,IF(AND(H10<=100,F5<=90,G16>=6),225,IF(AND(H10<=150,F5<=30,G16>=6),115,IF(AND(H10<=150,F5<=50,G16>=6),135,IF(AND(H10<=150,F5<=70,G16>=6),160,IF(AND(H10<=150,F5<=90,G16>=6),180,IF(AND(H10<=200,F5<=30,G16>=6),70,IF(AND(H10<=200,F5<=50,G16>=6),95,IF(AND(H10<=200,F5<=70,G16>=6),115,IF(AND(H10<=200,F5<=90,G16>=6),140,IF(AND(H10<=340,F5<=30,G16>=6),35,IF(AND(H10<=340,F5<=50,G16>=6),60,IF(AND(H10<=340,F5<=70,G16>=6),80,IF(AND(H10<=340,F5<=90,G16>=6),105,IF(AND(H10>=340,F5<=30,G16>=6),0,IF(AND(H10>=340,F5<=50,G16>=6),0,IF(AND(H10>=340,F5<=70,G16>=6),0,IF(AND(H10>=340,F5<=90,G16>=6),0))))))))))))))))))))))))))))))))))))","v":95},null,0,{"$f":"IF(AND(K10<20,J5<=60),130,IF(AND(K10<20,J5<=90),145,IF(AND(K10<20,J5<=120),160,IF(AND(K10<20,J5<=150),175,IF(AND(K10<40,J5<=60),80,IF(AND(K10<40,J5<=90),95,IF(AND(K10<40,J5<=120),110,IF(AND(K10<40,J5<=150),125,IF(AND(K10<100,J5<=60),30,IF(AND(K10<100,J5<=90),45,IF(AND(K10<100,J5<=120),60,IF(AND(K10<100,J5<=150),75,IF(AND(K10>=100,J5<=60),0,IF(AND(K10>=100,J5<=90),0,IF(AND(K10>=100,J5<=120),0,IF(AND(K10>=100,J5<=150),0))))))))))))))))","v":130},{"$f":"IF(AND(L10<=100,J5<=60,K16<=5),80,IF(AND(L10<=100,J5<=150,K16<=5),85,IF(AND(L10<=100,J5<=120,K16<=5),95,IF(AND(L10<=100,J5<=150,K16<=5),100,IF(AND(L10<=150,J5<=60,K16<=5),45,IF(AND(L10<=150,J5<=150,K16<=5),55,IF(AND(L10<=150,J5<=120,K16<=5),60,IF(AND(L10<=150,J5<=150,K16<=5),70,IF(AND(L10<=260,J5<=60,K16<=5),15,IF(AND(L10<=260,J5<=150,K16<=5),25,IF(AND(L10<=260,J5<=120,K16<=5),30,IF(AND(L10<=260,J5<=150,K16<=5),40,IF(AND(L10>=260,J5<=60,K16<=5),0,IF(AND(L10>=260,J5<=150,K16<=5),0,IF(AND(L10>=260,J5<=120,K16<=5),0,IF(AND(L10>=260,J5<=150,K16<=5),0,IF(AND(L10<=100,J5<=60,K16>=6),140,IF(AND(L10<=100,J5<=90,K16>=6),145,IF(AND(L10<=100,J5<=120,K16>=6),155,IF(AND(L10<=100,J5<=150,K16>=6),160,IF(AND(L10<=150,J5<=60,K16>=6),95,IF(AND(L10<=150,J5<=90,K16>=6),100,IF(AND(L10<=150,J5<=120,K16>=6),110,IF(AND(L10<=150,J5<=150,K16>=6),160,IF(AND(L10<=200,J5<=60,K16>=6),50,IF(AND(L10<=200,J5<=90,K16>=6),60,IF(AND(L10<=200,J5<=120,K16>=6),65,IF(AND(L10<=200,J5<=150,K16>=6),75,IF(AND(L10<=340,J5<=60,K16>=6),15,IF(AND(L10<=340,J5<=90,K16>=6),25,IF(AND(L10<=340,J5<=120,K16>=6),30,IF(AND(L10<=340,J5<=150,K16>=6),40,IF(AND(L10>=340,J5<=60,K16>=6),0,IF(AND(L10>=340,J5<=90,K16>=6),0,IF(AND(L10>=340,J5<=120,K16>=6),0,IF(AND(L10>=340,J5<=150,K16>=6),0))))))))))))))))))))))))))))))))))))","v":80}]
[null,"S","Ca","Mag",null,"S","Ca","Mag",null,"S","Ca","Mag"]
[null,0,{"$f":"IF(AND(C12<=200),42,IF(AND(C12>200),0))","v":42},{"$f":"MAX(IF(AND(C16<=8,C18<=7,D12<=70),11,IF(AND(C16>=8,C18>=7,D12<=100),50,IF(AND(D10>D12,C16<=8),11,IF(AND(D10>D12,C16>8),50)))))","v":11},null,0,{"$f":"IF(AND(G12<=200),42,IF(AND(G12>200),0))","v":42},{"$f":"MAX(IF(AND(G16<=8,G18<=7,H12<=70),11,IF(AND(G16>=8,G18>=7,H12<=100),50,IF(AND(H10>H12,G16<=8),11,IF(AND(H10>H12,G16>8),50)))))","v":11},null,0,{"$f":"IF(AND(K12<=200),42,IF(AND(K12>200),0))","v":42},{"$f":"MAX(IF(AND(K16<=8,K18<=7,L12<=70),11,IF(AND(K16>=8,K18>=7,L12<=100),50,IF(AND(L10>L12,K16<=8),11,IF(AND(L10>L12,K16>8),50)))))","v":11}]
[null,"Z","B","Mn",null,"Z","B","Mn",null,"Z","B","Mn"]
[null,{"$f":"MAX(((5*C18)-(0.4*B14)-32),0)","v":0},0,0,null,0,0,{"$f":"MAX(0,((6.2*G18)-(0.35*H14))-36)","v":0},null,0,0,{"$f":"MAX(0,((6.2*K18)-(0.35*L14))-36)","v":0}]
[]
[]
[null,"Note: This section is not a replacement for recommendations from a soil test analysis obtained from soil test laboratories.  "]
[null,null,"For soil test based recommendations, visit the MSU Soil and Plant Nutrient Laboratory:",null,null,null,null,null,null,"https://www.canr.msu.edu/spnl/"]

{"sheet":"Charts","index":15,"n_rows":41,"n_cols":12,"rows_kept":41,"cut":false,"hidden":true,"merged":[]}
[null,"Corn","Soybeans","Wheat",null,null,null,null,null,"Corn","Soybeans","Wheat"]
["Seed",{"$f":"#REF!","v":{"$error":"#REF!"}},{"$f":"#REF!","v":{"$error":"#REF!"}},{"$f":"#REF!","v":{"$error":"#REF!"}},null,null,null,null,"Variable",{"$f":"#REF!","v":{"$error":"#REF!"}},{"$f":"#REF!","v":{"$error":"#REF!"}},{"$f":"#REF!","v":{"$error":"#REF!"}}]
["Fertilizer",{"$f":"#REF!","v":{"$error":"#REF!"}},{"$f":"#REF!","v":{"$error":"#REF!"}},{"$f":"#REF!","v":{"$error":"#REF!"}},null,null,null,null,"Fixed",{"$f":"#REF!","v":{"$error":"#REF!"}},{"$f":"#REF!","v":{"$error":"#REF!"}},{"$f":"#REF!","v":{"$error":"#REF!"}}]
["Crop Chemicals",{"$f":"SUM(B5:B7)","v":{"$error":"#REF!"}},{"$f":"SUM(C5:C7)","v":{"$error":"#REF!"}},{"$error":"#REF!"},null,null,null,null,"Variable & Fixed",{"$f":"#REF!","v":{"$error":"#REF!"}},{"$f":"#REF!","v":{"$error":"#REF!"}},{"$f":"#REF!","v":{"$error":"#REF!"}}]
["Herbicides",{"$f":"#REF!","v":{"$error":"#REF!"}},{"$f":"#REF!","v":{"$error":"#REF!"}},{"$f":"#REF!","v":{"$error":"#REF!"}}]
["Fungicides",{"$f":"#REF!","v":{"$error":"#REF!"}},{"$f":"#REF!","v":{"$error":"#REF!"}},{"$f":"#REF!","v":{"$error":"#REF!"}}]
["Insecticides",{"$f":"#REF!","v":{"$error":"#REF!"}},{"$f":"#REF!","v":{"$error":"#REF!"}},{"$f":"#REF!","v":{"$error":"#REF!"}}]
["Crop Insurance",{"$f":"#REF!","v":{"$error":"#REF!"}},{"$f":"#REF!","v":{"$error":"#REF!"}},{"$f":"#REF!","v":{"$error":"#REF!"}}]
["Crop Miscellaneous",{"$f":"#REF!","v":{"$error":"#REF!"}},{"$f":"#REF!","v":{"$error":"#REF!"}},{"$f":"#REF!","v":{"$error":"#REF!"}}]
["Supplies",{"$f":"#REF!","v":{"$error":"#REF!"}},{"$f":"#REF!","v":{"$error":"#REF!"}},{"$f":"#REF!","v":{"$error":"#REF!"}}]
["Gas/Fuel",{"$f":"SUM(B12:B13)","v":{"$error":"#REF!"}},{"$f":"SUM(C12:C13)","v":{"$error":"#REF!"}},{"$error":"#REF!"}]
["Equipment Fuel",{"$f":"#REF!","v":{"$error":"#REF!"}},{"$f":"#REF!","v":{"$error":"#REF!"}},{"$f":"#REF!","v":{"$error":"#REF!"}}]
["Drying Propane",{"$f":"#REF!","v":{"$error":"#REF!"}},{"$f":"#REF!","v":{"$error":"#REF!"}},{"$f":"#REF!","v":{"$error":"#REF!"}}]
["Repairs & Maintenance",{"$f":"SUM(B15:B16)","v":{"$error":"#REF!"}},{"$f":"SUM(C15:C16)","v":{"$error":"#REF!"}},{"$error":"#REF!"}]
["Repair, Machinery",{"$f":"#REF!","v":{"$error":"#REF!"}},{"$f":"#REF!","v":{"$error":"#REF!"}},{"$f":"#REF!","v":{"$error":"#REF!"}}]
["Repair, Buildings",{"$f":"#REF!","v":{"$error":"#REF!"}},{"$f":"#REF!","v":{"$error":"#REF!"}},{"$f":"#REF!","v":{"$error":"#REF!"}}]
["Custom Hire",{"$f":"SUM(B18:B20)","v":{"$error":"#REF!"}},{"$f":"SUM(C18:C20)","v":{"$error":"#REF!"}},{"$error":"#REF!"}]
["Driver & Equipment Hire",{"$f":"#REF!","v":{"$error":"#REF!"}},{"$f":"#REF!","v":{"$error":"#REF!"}},{"$f":"#REF!","v":{"$error":"#REF!"}}]
["Equipment Hire",{"$f":"#REF!","v":{"$error":"#REF!"}},{"$f":"#REF!","v":{"$error":"#REF!"}},{"$f":"#REF!","v":{"$error":"#REF!"}}]
["Custom Application",{"$f":"#REF!","v":{"$error":"#REF!"}},{"$f":"#REF!","v":{"$error":"#REF!"}},{"$f":"#REF!","v":{"$error":"#REF!"}}]
["Freight & Trucking",{"$f":"#REF!","v":{"$error":"#REF!"}},{"$f":"#REF!","v":{"$error":"#REF!"}},{"$f":"#REF!","v":{"$error":"#REF!"}}]
["Storage",{"$f":"#REF!","v":{"$error":"#REF!"}},{"$f":"#REF!","v":{"$error":"#REF!"}},{"$f":"#REF!","v":{"$error":"#REF!"}}]
["Utilities",{"$f":"#REF!","v":{"$error":"#REF!"}},{"$f":"#REF!","v":{"$error":"#REF!"}},{"$f":"#REF!","v":{"$error":"#REF!"}}]
["Irrigation",{"$f":"SUM(B25:B26)","v":{"$error":"#REF!"}},{"$f":"SUM(C25:C26)","v":{"$error":"#REF!"}},{"$error":"#REF!"}]
["Repairs",{"$f":"#REF!","v":{"$error":"#REF!"}},{"$f":"#REF!","v":{"$error":"#REF!"}},{"$f":"#REF!","v":{"$error":"#REF!"}}]
["Fuel/Electricity",{"$f":"#REF!","v":{"$error":"#REF!"}},{"$f":"#REF!","v":{"$error":"#REF!"}},{"$f":"#REF!","v":{"$error":"#REF!"}}]
["Marketing",{"$f":"#REF!","v":{"$error":"#REF!"}},{"$f":"#REF!","v":{"$error":"#REF!"}},{"$f":"#REF!","v":{"$error":"#REF!"}}]
["Hired Labor",{"$f":"#REF!","v":{"$error":"#REF!"}},{"$f":"#REF!","v":{"$error":"#REF!"}},{"$f":"#REF!","v":{"$error":"#REF!"}}]
["Interest (Operating)",{"$f":"#REF!","v":{"$error":"#REF!"}},{"$f":"#REF!","v":{"$error":"#REF!"}},{"$f":"#REF!","v":{"$error":"#REF!"}}]
["Other (variable)",{"$f":"#REF!","v":{"$error":"#REF!"}},{"$f":"#REF!","v":{"$error":"#REF!"}},{"$f":"#REF!","v":{"$error":"#REF!"}}]
["Farm Insurance",{"$f":"#REF!","v":{"$error":"#REF!"}},{"$f":"#REF!","v":{"$error":"#REF!"}},{"$f":"#REF!","v":{"$error":"#REF!"}}]
["Real Estate Taxes",{"$f":"#REF!","v":{"$error":"#REF!"}},{"$f":"#REF!","v":{"$error":"#REF!"}},{"$f":"#REF!","v":{"$error":"#REF!"}}]
["Land Rent",{"$f":"#REF!","v":{"$error":"#REF!"}},{"$f":"#REF!","v":{"$error":"#REF!"}},{"$f":"#REF!","v":{"$error":"#REF!"}}]
["Depreciation (Economic )",{"$f":"#REF!","v":{"$error":"#REF!"}},{"$f":"#REF!","v":{"$error":"#REF!"}},{"$f":"#REF!","v":{"$error":"#REF!"}}]
["Other (fixed)",{"$f":"#REF!","v":{"$error":"#REF!"}},{"$f":"#REF!","v":{"$error":"#REF!"}},{"$f":"#REF!","v":{"$error":"#REF!"}}]
["Other (variable & fixed)",{"$f":"B35+B30","v":{"$error":"#REF!"}},{"$f":"C35+C30","v":{"$error":"#REF!"}},{"$f":"D35+D30","v":{"$error":"#REF!"}}]
["Income Taxes",{"$f":"#REF!","v":{"$error":"#REF!"}},{"$f":"#REF!","v":{"$error":"#REF!"}},{"$f":"#REF!","v":{"$error":"#REF!"}}]
["Owner Withdrawal",{"$f":"#REF!","v":{"$error":"#REF!"}},{"$f":"#REF!","v":{"$error":"#REF!"}},{"$f":"#REF!","v":{"$error":"#REF!"}}]
["Interest (Oper & Term)",{"$f":"B40+B29","v":{"$error":"#REF!"}},{"$f":"C40+C29","v":{"$error":"#REF!"}},{"$f":"D40+D29","v":{"$error":"#REF!"}}]
["Interest (Term)",{"$f":"#REF!","v":{"$error":"#REF!"}},{"$f":"#REF!","v":{"$error":"#REF!"}},{"$f":"#REF!","v":{"$error":"#REF!"}}]
["Principal Payment",{"$f":"#REF!","v":{"$error":"#REF!"}},{"$f":"#REF!","v":{"$error":"#REF!"}},{"$f":"#REF!","v":{"$error":"#REF!"}}]